UnstableConsole Output

Skipping 651 KB.. Full Log
t] INFO  - Max location name (Chelmsford) length 10 [main] jmrit.operations.locations.LocationManager.?()
    [junit] INFO  - Max location and track name (Chelmsford, Chelmsford Interchange 1) length 34 [main] jmrit.operations.locations.LocationManager.?()
    [junit] INFO  - Saving copy of operations files to: temp/operations/JUnitTest/autoBackups/2019_05_15_00 [main] jmrit.operations.setup.BackupBase.?()
    [junit] INFO  - Max road name (ALTON) length 5 [main] operations.rollingstock.cars.CarRoads.?()
    [junit] INFO  - Max track name (track) at (C) length 5 [main] jmrit.operations.locations.LocationManager.?()
    [junit] INFO  - Max location name (C) length 1 [main] jmrit.operations.locations.LocationManager.?()
    [junit] INFO  - Max location and track name (C, track) length 6 [main] jmrit.operations.locations.LocationManager.?()
    [junit] INFO  - Saving copy of operations files to: temp/operations/JUnitTest/autoBackups/2019_05_15_00 [main] jmrit.operations.setup.BackupBase.?()
    [junit] INFO  - Max road name (ALTON) length 5 [main] operations.rollingstock.cars.CarRoads.?()
    [junit] INFO  - Max track name (South End 1) at (South End Staging) length 11 [main] jmrit.operations.locations.LocationManager.?()
    [junit] INFO  - Max location name (South End Staging) length 17 [main] jmrit.operations.locations.LocationManager.?()
    [junit] INFO  - Max location and track name (South End Staging, South End 1) length 28 [main] jmrit.operations.locations.LocationManager.?()
    [junit] INFO  - Max car type name (FlatBulkHead) length 12 [main] operations.rollingstock.cars.CarTypes.?()
    [junit] INFO  - Saving copy of operations files to: temp/operations/JUnitTest/autoBackups/2019_05_15_00 [main] jmrit.operations.setup.BackupBase.?()
    [junit] INFO  - Max road name (ALTON) length 5 [main] operations.rollingstock.cars.CarRoads.?()
    [junit] INFO  - Max track name (South End 1) at (South End Staging) length 11 [main] jmrit.operations.locations.LocationManager.?()
    [junit] INFO  - Max location name (South End Staging) length 17 [main] jmrit.operations.locations.LocationManager.?()
    [junit] INFO  - Max location and track name (South End Staging, South End 1) length 28 [main] jmrit.operations.locations.LocationManager.?()
    [junit] INFO  - Max car type name (FlatBulkHead) length 12 [main] operations.rollingstock.cars.CarTypes.?()
    [junit] INFO  - Saving copy of operations files to: temp/operations/JUnitTest/autoBackups/2019_05_15_00 [main] jmrit.operations.setup.BackupBase.?()
    [junit] INFO  - Max road name (ALTON) length 5 [main] operations.rollingstock.cars.CarRoads.?()
    [junit] INFO  - Max track name (Chelmsford Yard 1) at (Chelmsford) length 17 [main] jmrit.operations.locations.LocationManager.?()
    [junit] INFO  - Max location name (Chelmsford) length 10 [main] jmrit.operations.locations.LocationManager.?()
    [junit] INFO  - Max location and track name (Chelmsford, Chelmsford Yard 1) length 27 [main] jmrit.operations.locations.LocationManager.?()
    [junit] INFO  - Max car type name (FlatBulkHead) length 12 [main] operations.rollingstock.cars.CarTypes.?()
    [junit] INFO  - Saving copy of operations files to: temp/operations/JUnitTest/autoBackups/2019_05_15_00 [main] jmrit.operations.setup.BackupBase.?()
    [junit] INFO  - Move train (TestAggressiveBuildOption) to location (Old Harvard) [main] jmrit.operations.trains.Train.?()
    [junit] INFO  - Move train (TestAggressiveBuildOption) to location (Harvard) [main] jmrit.operations.trains.Train.?()
    [junit] INFO  - Move train (TestAggressiveBuildOption) to location (Acton) [main] jmrit.operations.trains.Train.?()
    [junit] INFO  - Move train (TestAggressiveBuildOption) to location (Acton) [main] jmrit.operations.trains.Train.?()
    [junit] INFO  - Move train (TestAggressiveBuildOption) to location (Chelmsford) [main] jmrit.operations.trains.Train.?()
    [junit] INFO  - Move train (TestAggressiveBuildOption) to location (Westford) [main] jmrit.operations.trains.Train.?()
    [junit] INFO  - Move train (TestAggressiveBuildOption) to location (Westford) [main] jmrit.operations.trains.Train.?()
    [junit] INFO  - Max track name (Acton Alternate Track) at (Acton) length 21 [main] jmrit.operations.locations.LocationManager.?()
    [junit] INFO  - Max location name (Chelmsford) length 10 [main] jmrit.operations.locations.LocationManager.?()
    [junit] INFO  - Max location and track name (Chelmsford, Chelmsford Yard 1) length 27 [main] jmrit.operations.locations.LocationManager.?()
    [junit] INFO  - Max road name (ALTON) length 5 [main] operations.rollingstock.cars.CarRoads.?()
    [junit] INFO  - Max track name (South End 1) at (South End Staging) length 11 [main] jmrit.operations.locations.LocationManager.?()
    [junit] INFO  - Max location name (South End Staging) length 17 [main] jmrit.operations.locations.LocationManager.?()
    [junit] INFO  - Max location and track name (South End Staging, South End 1) length 28 [main] jmrit.operations.locations.LocationManager.?()
    [junit] INFO  - Max car type name (FlatBulkHead) length 12 [main] operations.rollingstock.cars.CarTypes.?()
    [junit] INFO  - Saving copy of operations files to: temp/operations/JUnitTest/autoBackups/2019_05_15_00 [main] jmrit.operations.setup.BackupBase.?()
    [junit] INFO  - Max road name (ALTON) length 5 [main] operations.rollingstock.cars.CarRoads.?()
    [junit] INFO  - Max track name (South End 1) at (South End Staging) length 11 [main] jmrit.operations.locations.LocationManager.?()
    [junit] INFO  - Max location name (South End Staging) length 17 [main] jmrit.operations.locations.LocationManager.?()
    [junit] INFO  - Max location and track name (South End Staging, South End 1) length 28 [main] jmrit.operations.locations.LocationManager.?()
    [junit] INFO  - Max car type name (FlatBulkHead) length 12 [main] operations.rollingstock.cars.CarTypes.?()
    [junit] INFO  - Saving copy of operations files to: temp/operations/JUnitTest/autoBackups/2019_05_15_00 [main] jmrit.operations.setup.BackupBase.?()
    [junit] INFO  - Max road name (ALTON) length 5 [main] operations.rollingstock.cars.CarRoads.?()
    [junit] INFO  - Max car type name (FlatBulkHead) length 12 [main] operations.rollingstock.cars.CarTypes.?()
    [junit] INFO  - Max track name (Westend interchange 1) at (Westend) length 21 [main] jmrit.operations.locations.LocationManager.?()
    [junit] INFO  - Max location name (Northend) length 8 [main] jmrit.operations.locations.LocationManager.?()
    [junit] INFO  - Max location and track name (Westend, Westend interchange 1) length 28 [main] jmrit.operations.locations.LocationManager.?()
    [junit] INFO  - Saving copy of operations files to: temp/operations/JUnitTest/autoBackups/2019_05_15_00 [main] jmrit.operations.setup.BackupBase.?()
    [junit] INFO  - Max road name (ALTON) length 5 [main] operations.rollingstock.cars.CarRoads.?()
    [junit] INFO  - Max car type name (FlatBulkHead) length 12 [main] operations.rollingstock.cars.CarTypes.?()
    [junit] INFO  - Max track name (South End 1) at (South End Staging) length 11 [main] jmrit.operations.locations.LocationManager.?()
    [junit] INFO  - Max location name (South End Staging) length 17 [main] jmrit.operations.locations.LocationManager.?()
    [junit] INFO  - Max location and track name (South End Staging, South End 1) length 28 [main] jmrit.operations.locations.LocationManager.?()
    [junit] INFO  - Saving copy of operations files to: temp/operations/JUnitTest/autoBackups/2019_05_15_00 [main] jmrit.operations.setup.BackupBase.?()
    [junit] INFO  - Max road name (ALTON) length 5 [main] operations.rollingstock.cars.CarRoads.?()
    [junit] INFO  - Max car type name (FlatBulkHead) length 12 [main] operations.rollingstock.cars.CarTypes.?()
    [junit] INFO  - Max track name (Chelmsford Interchange 1) at (Chelmsford) length 24 [main] jmrit.operations.locations.LocationManager.?()
    [junit] INFO  - Max location name (Chelmsford) length 10 [main] jmrit.operations.locations.LocationManager.?()
    [junit] INFO  - Max location and track name (Chelmsford, Chelmsford Interchange 1) length 34 [main] jmrit.operations.locations.LocationManager.?()
    [junit] INFO  - Saving copy of operations files to: temp/operations/JUnitTest/autoBackups/2019_05_15_00 [main] jmrit.operations.setup.BackupBase.?()
    [junit] INFO  - Saving copy of operations files to: temp/operations/JUnitTest/autoBackups/2019_05_15_00 [main] jmrit.operations.setup.BackupBase.?()
    [junit] INFO  - Max road name (ALTON) length 5 [main] operations.rollingstock.cars.CarRoads.?()
    [junit] INFO  - Max car type name (FlatBulkHead) length 12 [main] operations.rollingstock.cars.CarTypes.?()
    [junit] INFO  - Max track name (Chelmsford Interchange 1) at (Chelmsford) length 24 [main] jmrit.operations.locations.LocationManager.?()
    [junit] INFO  - Max location name (Chelmsford) length 10 [main] jmrit.operations.locations.LocationManager.?()
    [junit] INFO  - Max location and track name (Chelmsford, Chelmsford Interchange 1) length 34 [main] jmrit.operations.locations.LocationManager.?()
    [junit] INFO  - Saving copy of operations files to: temp/operations/JUnitTest/autoBackups/2019_05_15_00 [main] jmrit.operations.setup.BackupBase.?()
    [junit] INFO  - Saving copy of operations files to: temp/operations/JUnitTest/autoBackups/2019_05_15_00 [main] jmrit.operations.setup.BackupBase.?()
    [junit] INFO  - Max road name (ALTON) length 5 [main] operations.rollingstock.cars.CarRoads.?()
    [junit] INFO  - Max car type name (FlatBulkHead) length 12 [main] operations.rollingstock.cars.CarTypes.?()
    [junit] INFO  - Max track name (South End 1) at (South End Staging) length 11 [main] jmrit.operations.locations.LocationManager.?()
    [junit] INFO  - Max location name (South End Staging) length 17 [main] jmrit.operations.locations.LocationManager.?()
    [junit] INFO  - Max location and track name (South End Staging, South End 1) length 28 [main] jmrit.operations.locations.LocationManager.?()
    [junit] INFO  - Saving copy of operations files to: temp/operations/JUnitTest/autoBackups/2019_05_15_00 [main] jmrit.operations.setup.BackupBase.?()
    [junit] INFO  - Max road name (ALTON) length 5 [main] operations.rollingstock.cars.CarRoads.?()
    [junit] INFO  - Max car type name (FlatBulkHead) length 12 [main] operations.rollingstock.cars.CarTypes.?()
    [junit] INFO  - Max track name (South End 1) at (South End Staging) length 11 [main] jmrit.operations.locations.LocationManager.?()
    [junit] INFO  - Max location name (South End Staging) length 17 [main] jmrit.operations.locations.LocationManager.?()
    [junit] INFO  - Max location and track name (South End Staging, South End 1) length 28 [main] jmrit.operations.locations.LocationManager.?()
    [junit] INFO  - Saving copy of operations files to: temp/operations/JUnitTest/autoBackups/2019_05_15_00 [main] jmrit.operations.setup.BackupBase.?()
    [junit] INFO  - Max road name (ALTON) length 5 [main] operations.rollingstock.cars.CarRoads.?()
    [junit] INFO  - Max car type name (FlatBulkHead) length 12 [main] operations.rollingstock.cars.CarTypes.?()
    [junit] INFO  - Max track name (South End 1) at (South End Staging) length 11 [main] jmrit.operations.locations.LocationManager.?()
    [junit] INFO  - Max location name (South End Staging) length 17 [main] jmrit.operations.locations.LocationManager.?()
    [junit] INFO  - Max location and track name (South End Staging, South End 1) length 28 [main] jmrit.operations.locations.LocationManager.?()
    [junit] INFO  - Saving copy of operations files to: temp/operations/JUnitTest/autoBackups/2019_05_15_00 [main] jmrit.operations.setup.BackupBase.?()
    [junit] INFO  - Max road name (ALTON) length 5 [main] operations.rollingstock.cars.CarRoads.?()
    [junit] INFO  - Max car type name (FlatBulkHead) length 12 [main] operations.rollingstock.cars.CarTypes.?()
    [junit] INFO  - Max track name (South End 1) at (South End Staging) length 11 [main] jmrit.operations.locations.LocationManager.?()
    [junit] INFO  - Max location name (South End Staging) length 17 [main] jmrit.operations.locations.LocationManager.?()
    [junit] INFO  - Max location and track name (South End Staging, South End 1) length 28 [main] jmrit.operations.locations.LocationManager.?()
    [junit] INFO  - Saving copy of operations files to: temp/operations/JUnitTest/autoBackups/2019_05_15_00 [main] jmrit.operations.setup.BackupBase.?()
    [junit] INFO  - Max road name (ALTON) length 5 [main] operations.rollingstock.cars.CarRoads.?()
    [junit] INFO  - Max car type name (FlatBulkHead) length 12 [main] operations.rollingstock.cars.CarTypes.?()
    [junit] INFO  - Max track name (Midtown Inbound from East) at (Midtown) length 25 [main] jmrit.operations.locations.LocationManager.?()
    [junit] INFO  - Max location name (Eastend) length 7 [main] jmrit.operations.locations.LocationManager.?()
    [junit] INFO  - Max location and track name (Midtown, Midtown Inbound from East) length 32 [main] jmrit.operations.locations.LocationManager.?()
    [junit] INFO  - Saving copy of operations files to: temp/operations/JUnitTest/autoBackups/2019_05_15_00 [main] jmrit.operations.setup.BackupBase.?()
    [junit] INFO  - Max road name (ALTON) length 5 [main] operations.rollingstock.cars.CarRoads.?()
    [junit] INFO  - Max car type name (FlatBulkHead) length 12 [main] operations.rollingstock.cars.CarTypes.?()
    [junit] INFO  - Max track name (South End 1) at (South End Staging) length 11 [main] jmrit.operations.locations.LocationManager.?()
    [junit] INFO  - Max location name (South End Staging) length 17 [main] jmrit.operations.locations.LocationManager.?()
    [junit] INFO  - Max location and track name (South End Staging, South End 1) length 28 [main] jmrit.operations.locations.LocationManager.?()
    [junit] INFO  - Saving copy of operations files to: temp/operations/JUnitTest/autoBackups/2019_05_15_00 [main] jmrit.operations.setup.BackupBase.?()
    [junit] INFO  - Max road name (ALTON) length 5 [main] operations.rollingstock.cars.CarRoads.?()
    [junit] INFO  - Max car type name (FlatBulkHead) length 12 [main] operations.rollingstock.cars.CarTypes.?()
    [junit] INFO  - Max track name (South End 1) at (South End Staging) length 11 [main] jmrit.operations.locations.LocationManager.?()
    [junit] INFO  - Max location name (South End Staging) length 17 [main] jmrit.operations.locations.LocationManager.?()
    [junit] INFO  - Max location and track name (South End Staging, South End 1) length 28 [main] jmrit.operations.locations.LocationManager.?()
    [junit] INFO  - Saving copy of operations files to: temp/operations/JUnitTest/autoBackups/2019_05_15_00 [main] jmrit.operations.setup.BackupBase.?()
    [junit] INFO  - Max road name (ALTON) length 5 [main] operations.rollingstock.cars.CarRoads.?()
    [junit] INFO  - Max car type name (FlatBulkHead) length 12 [main] operations.rollingstock.cars.CarTypes.?()
    [junit] INFO  - Max track name (South End 1) at (South End Staging) length 11 [main] jmrit.operations.locations.LocationManager.?()
    [junit] INFO  - Max location name (South End Staging) length 17 [main] jmrit.operations.locations.LocationManager.?()
    [junit] INFO  - Max location and track name (South End Staging, South End 1) length 28 [main] jmrit.operations.locations.LocationManager.?()
    [junit] INFO  - Saving copy of operations files to: temp/operations/JUnitTest/autoBackups/2019_05_15_00 [main] jmrit.operations.setup.BackupBase.?()
    [junit] INFO  - Max road name (ALTON) length 5 [main] operations.rollingstock.cars.CarRoads.?()
    [junit] INFO  - Max car type name (FlatBulkHead) length 12 [main] operations.rollingstock.cars.CarTypes.?()
    [junit] INFO  - Max track name (Chelmsford Interchange 1) at (Chelmsford) length 24 [main] jmrit.operations.locations.LocationManager.?()
    [junit] INFO  - Max location name (Chelmsford) length 10 [main] jmrit.operations.locations.LocationManager.?()
    [junit] INFO  - Max location and track name (Chelmsford, Chelmsford Interchange 1) length 34 [main] jmrit.operations.locations.LocationManager.?()
    [junit] INFO  - Saving copy of operations files to: temp/operations/JUnitTest/autoBackups/2019_05_15_00 [main] jmrit.operations.setup.BackupBase.?()
    [junit] INFO  - Max road name (ALTON) length 5 [main] operations.rollingstock.cars.CarRoads.?()
    [junit] INFO  - Max car type name (FlatBulkHead) length 12 [main] operations.rollingstock.cars.CarTypes.?()
    [junit] INFO  - Max track name (South End 1) at (South End Staging) length 11 [main] jmrit.operations.locations.LocationManager.?()
    [junit] INFO  - Max location name (South End Staging) length 17 [main] jmrit.operations.locations.LocationManager.?()
    [junit] INFO  - Max location and track name (South End Staging, South End 1) length 28 [main] jmrit.operations.locations.LocationManager.?()
    [junit] INFO  - Saving copy of operations files to: temp/operations/JUnitTest/autoBackups/2019_05_15_00 [main] jmrit.operations.setup.BackupBase.?()
    [junit] INFO  - Max road name (ALTON) length 5 [main] operations.rollingstock.cars.CarRoads.?()
    [junit] INFO  - Max track name (South End 1) at (South End Staging) length 11 [main] jmrit.operations.locations.LocationManager.?()
    [junit] INFO  - Max location name (South End Staging) length 17 [main] jmrit.operations.locations.LocationManager.?()
    [junit] INFO  - Max location and track name (South End Staging, South End 1) length 28 [main] jmrit.operations.locations.LocationManager.?()
    [junit] INFO  - Max car type name (FlatBulkHead) length 12 [main] operations.rollingstock.cars.CarTypes.?()
    [junit] INFO  - Saving copy of operations files to: temp/operations/JUnitTest/autoBackups/2019_05_15_00 [main] jmrit.operations.setup.BackupBase.?()
    [junit] INFO  - Max road name (ALTON) length 5 [main] operations.rollingstock.cars.CarRoads.?()
    [junit] INFO  - Max track name (track) at (C) length 5 [main] jmrit.operations.locations.LocationManager.?()
    [junit] INFO  - Max location name (C) length 1 [main] jmrit.operations.locations.LocationManager.?()
    [junit] INFO  - Max location and track name (C, track) length 6 [main] jmrit.operations.locations.LocationManager.?()
    [junit] INFO  - Saving copy of operations files to: temp/operations/JUnitTest/autoBackups/2019_05_15_00 [main] jmrit.operations.setup.BackupBase.?()
    [junit] INFO  - No temp/operations/JUnitTest/OperationsJUnitTestTrainRoster.xml file to backup [main] jmri.jmrit.XmlFile.?()
    [junit] INFO  - Max road name (ALTON) length 5 [main] operations.rollingstock.cars.CarRoads.?()
    [junit] INFO  - Max car type name (Caboose) length 7 [main] operations.rollingstock.cars.CarTypes.?()
    [junit] INFO  - Max track name (South End 1) at (South End Staging) length 11 [main] jmrit.operations.locations.LocationManager.?()
    [junit] INFO  - Max location name (South End Staging) length 17 [main] jmrit.operations.locations.LocationManager.?()
    [junit] INFO  - Max location and track name (South End Staging, South End 1) length 28 [main] jmrit.operations.locations.LocationManager.?()
    [junit] INFO  - Saving copy of operations files to: temp/operations/JUnitTest/autoBackups/2019_05_15_00 [main] jmrit.operations.setup.BackupBase.?()
    [junit] INFO  - No temp/operations/JUnitTest/ExportOperationsTrainRoster.csv file to backup [main] jmri.jmrit.XmlFile.?()
    [junit] INFO  - Exported 2 trains to file temp/operations/JUnitTest/ExportOperationsTrainRoster.csv [main] rollingstock.cars.tools.ExportCars.?()
    [junit] INFO  - Max road name (ALTON) length 5 [main] operations.rollingstock.cars.CarRoads.?()
    [junit] INFO  - Max car type name (Caboose) length 7 [main] operations.rollingstock.cars.CarTypes.?()
    [junit] INFO  - Max track name (South End 1) at (South End Staging) length 11 [main] jmrit.operations.locations.LocationManager.?()
    [junit] INFO  - Max location name (South End Staging) length 17 [main] jmrit.operations.locations.LocationManager.?()
    [junit] INFO  - Max location and track name (South End Staging, South End 1) length 28 [main] jmrit.operations.locations.LocationManager.?()
    [junit] INFO  - Saving copy of operations files to: temp/operations/JUnitTest/autoBackups/2019_05_15_00 [main] jmrit.operations.setup.BackupBase.?()
    [junit] INFO  - No temp/operations/JUnitTest/OperationsJUnitTestLocationRoster.xml file to backup [main] jmri.jmrit.XmlFile.?()
    [junit] INFO  - No temp/operations/JUnitTest/OperationsJUnitTestRouteRoster.xml file to backup [main] jmri.jmrit.XmlFile.?()
    [junit] INFO  - No temp/operations/JUnitTest/OperationsJUnitTestCarRoster.xml file to backup [main] jmri.jmrit.XmlFile.?()
    [junit] INFO  - No temp/operations/JUnitTest/OperationsJUnitTestEngineRoster.xml file to backup [main] jmri.jmrit.XmlFile.?()
    [junit] INFO  - No temp/operations/JUnitTest/OperationsJUnitTestTrainRoster.xml file to backup [main] jmri.jmrit.XmlFile.?()
    [junit] INFO  - No temp/operations/JUnitTest/OperationsJUnitTestTrainRoster.xml file to backup [main] jmri.jmrit.XmlFile.?()
    [junit] INFO  - Max road name (ALTON) length 5 [main] operations.rollingstock.cars.CarRoads.?()
    [junit] INFO  - Max car type name (Caboose) length 7 [main] operations.rollingstock.cars.CarTypes.?()
    [junit] INFO  - Max track name (South End 1) at (South End Staging) length 11 [main] jmrit.operations.locations.LocationManager.?()
    [junit] INFO  - Max location name (South End Staging) length 17 [main] jmrit.operations.locations.LocationManager.?()
    [junit] INFO  - Max location and track name (South End Staging, South End 1) length 28 [main] jmrit.operations.locations.LocationManager.?()
    [junit] INFO  - Saving copy of operations files to: temp/operations/JUnitTest/autoBackups/2019_05_15_00 [main] jmrit.operations.setup.BackupBase.?()
    [junit] INFO  - Max road name (ALTON) length 5 [main] operations.rollingstock.cars.CarRoads.?()
    [junit] INFO  - Max car type name (Caboose) length 7 [main] operations.rollingstock.cars.CarTypes.?()
    [junit] INFO  - Max track name (South End 1) at (South End Staging) length 11 [main] jmrit.operations.locations.LocationManager.?()
    [junit] INFO  - Max location name (South End Staging) length 17 [main] jmrit.operations.locations.LocationManager.?()
    [junit] INFO  - Max location and track name (South End Staging, South End 1) length 28 [main] jmrit.operations.locations.LocationManager.?()
    [junit] INFO  - Saving copy of operations files to: temp/operations/JUnitTest/autoBackups/2019_05_15_00 [main] jmrit.operations.setup.BackupBase.?()
    [junit] INFO  - Saving copy of operations files to: temp/operations/JUnitTest/autoBackups/2019_05_15_00 [main] jmrit.operations.setup.BackupBase.?()
    [junit] INFO  - Saving copy of operations files to: temp/operations/JUnitTest/autoBackups/2019_05_15_00 [main] jmrit.operations.setup.BackupBase.?()
    [junit] INFO  - Max road name (ALTON) length 5 [main] operations.rollingstock.cars.CarRoads.?()
    [junit] INFO  - Max car type name (Caboose) length 7 [main] operations.rollingstock.cars.CarTypes.?()
    [junit] INFO  - Max track name (South End 1) at (South End Staging) length 11 [main] jmrit.operations.locations.LocationManager.?()
    [junit] INFO  - Max location name (South End Staging) length 17 [main] jmrit.operations.locations.LocationManager.?()
    [junit] INFO  - Max location and track name (South End Staging, South End 1) length 28 [main] jmrit.operations.locations.LocationManager.?()
    [junit] INFO  - Saving copy of operations files to: temp/operations/JUnitTest/autoBackups/2019_05_15_00 [main] jmrit.operations.setup.BackupBase.?()
    [junit] INFO  - Max road name (ALTON) length 5 [main] operations.rollingstock.cars.CarRoads.?()
    [junit] INFO  - Max car type name (Caboose) length 7 [main] operations.rollingstock.cars.CarTypes.?()
    [junit] INFO  - Max track name (South End 1) at (South End Staging) length 11 [main] jmrit.operations.locations.LocationManager.?()
    [junit] INFO  - Max location name (South End Staging) length 17 [main] jmrit.operations.locations.LocationManager.?()
    [junit] INFO  - Max location and track name (South End Staging, South End 1) length 28 [main] jmrit.operations.locations.LocationManager.?()
    [junit] INFO  - Saving copy of operations files to: temp/operations/JUnitTest/autoBackups/2019_05_15_00 [main] jmrit.operations.setup.BackupBase.?()
    [junit] INFO  - Saving copy of operations files to: temp/operations/JUnitTest/autoBackups/2019_05_15_00 [main] jmrit.operations.setup.BackupBase.?()
    [junit] INFO  - Saving copy of operations files to: temp/operations/JUnitTest/autoBackups/2019_05_15_00 [main] jmrit.operations.setup.BackupBase.?()
    [junit] INFO  - No temp/operations/JUnitTest/OperationsJUnitTest.xml file to backup [main] jmri.jmrit.XmlFile.?()
    [junit] INFO  - No temp/operations/JUnitTest/OperationsJUnitTestTrainRoster.xml file to backup [main] jmri.jmrit.XmlFile.?()
    [junit] INFO  - Saving copy of operations files to: temp/operations/JUnitTest/autoBackups/2019_05_15_00 [main] jmrit.operations.setup.BackupBase.?()
    [junit] INFO  - Saving copy of operations files to: temp/operations/JUnitTest/autoBackups/2019_05_15_00 [main] jmrit.operations.setup.BackupBase.?()
    [junit] INFO  - Saving copy of operations files to: temp/operations/JUnitTest/autoBackups/2019_05_15_00 [main] jmrit.operations.setup.BackupBase.?()
    [junit] INFO  - No temp/operations/JUnitTest/OperationsJUnitTest.xml file to backup [main] jmri.jmrit.XmlFile.?()
    [junit] INFO  - No temp/operations/JUnitTest/OperationsJUnitTestTrainRoster.xml file to backup [main] jmri.jmrit.XmlFile.?()
    [junit] INFO  - Saving copy of operations files to: temp/operations/JUnitTest/autoBackups/2019_05_15_00 [main] jmrit.operations.setup.BackupBase.?()
    [junit] INFO  - Max road name (ALTON) length 5 [main] operations.rollingstock.cars.CarRoads.?()
    [junit] INFO  - Max car type name (Caboose) length 7 [main] operations.rollingstock.cars.CarTypes.?()
    [junit] INFO  - Max track name (South End 1) at (South End Staging) length 11 [main] jmrit.operations.locations.LocationManager.?()
    [junit] INFO  - Max location name (South End Staging) length 17 [main] jmrit.operations.locations.LocationManager.?()
    [junit] INFO  - Max location and track name (South End Staging, South End 1) length 28 [main] jmrit.operations.locations.LocationManager.?()
    [junit] INFO  - Saving copy of operations files to: temp/operations/JUnitTest/autoBackups/2019_05_15_00 [main] jmrit.operations.setup.BackupBase.?()
    [junit] INFO  - No temp/operations/JUnitTest/OperationsJUnitTestLocationRoster.xml file to backup [main] jmri.jmrit.XmlFile.?()
    [junit] INFO  - No temp/operations/JUnitTest/OperationsJUnitTestRouteRoster.xml file to backup [main] jmri.jmrit.XmlFile.?()
    [junit] INFO  - No temp/operations/JUnitTest/OperationsJUnitTestCarRoster.xml file to backup [main] jmri.jmrit.XmlFile.?()
    [junit] INFO  - No temp/operations/JUnitTest/OperationsJUnitTestEngineRoster.xml file to backup [main] jmri.jmrit.XmlFile.?()
    [junit] INFO  - No temp/operations/JUnitTest/OperationsJUnitTestTrainRoster.xml file to backup [main] jmri.jmrit.XmlFile.?()
    [junit] INFO  - Max road name (ALTON) length 5 [main] operations.rollingstock.cars.CarRoads.?()
    [junit] INFO  - Max car type name (Caboose) length 7 [main] operations.rollingstock.cars.CarTypes.?()
    [junit] INFO  - Max track name (South End 1) at (South End Staging) length 11 [main] jmrit.operations.locations.LocationManager.?()
    [junit] INFO  - Max location name (South End Staging) length 17 [main] jmrit.operations.locations.LocationManager.?()
    [junit] INFO  - Max location and track name (South End Staging, South End 1) length 28 [main] jmrit.operations.locations.LocationManager.?()
    [junit] INFO  - Saving copy of operations files to: temp/operations/JUnitTest/autoBackups/2019_05_15_00 [main] jmrit.operations.setup.BackupBase.?()
    [junit] INFO  - No temp/operations/JUnitTest/OperationsJUnitTest.xml file to backup [main] jmri.jmrit.XmlFile.?()
    [junit] INFO  - Max road name (ALTON) length 5 [main] operations.rollingstock.cars.CarRoads.?()
    [junit] INFO  - Max track name (Spur at A-1) at (Test Location A-1) length 9 [main] jmrit.operations.locations.LocationManager.?()
    [junit] INFO  - Max location name (Test Location A-1) length 15 [main] jmrit.operations.locations.LocationManager.?()
    [junit] INFO  - Max location and track name (Test Location A-1, Spur at A-1) length 24 [main] jmrit.operations.locations.LocationManager.?()
    [junit] INFO  - Max car type name (Boxcar) length 6 [main] operations.rollingstock.cars.CarTypes.?()
    [junit] INFO  - Saving copy of operations files to: temp/operations/JUnitTest/autoBackups/2019_05_15_00 [main] jmrit.operations.setup.BackupBase.?()
    [junit] INFO  - Max road name (ALTON) length 5 [main] operations.rollingstock.cars.CarRoads.?()
    [junit] INFO  - Max track name (Yard at C) at (Test Location C) length 9 [main] jmrit.operations.locations.LocationManager.?()
    [junit] INFO  - Max location name (Test Location C) length 15 [main] jmrit.operations.locations.LocationManager.?()
    [junit] INFO  - Max location and track name (Test Location C, Yard at C) length 24 [main] jmrit.operations.locations.LocationManager.?()
    [junit] INFO  - Max car type name (Boxcar) length 6 [main] operations.rollingstock.cars.CarTypes.?()
    [junit] INFO  - Saving copy of operations files to: temp/operations/JUnitTest/autoBackups/2019_05_15_00 [main] jmrit.operations.setup.BackupBase.?()
    [junit] INFO  - Max road name (ALTON) length 5 [main] operations.rollingstock.cars.CarRoads.?()
    [junit] INFO  - Max car type name (Boxcar) length 6 [main] operations.rollingstock.cars.CarTypes.?()
    [junit] INFO  - Max track name (Spur at A-1) at (Test Location A-1) length 9 [main] jmrit.operations.locations.LocationManager.?()
    [junit] INFO  - Max location name (Test Location A-1) length 15 [main] jmrit.operations.locations.LocationManager.?()
    [junit] INFO  - Max location and track name (Test Location A-1, Spur at A-1) length 24 [main] jmrit.operations.locations.LocationManager.?()
    [junit] INFO  - Saving copy of operations files to: temp/operations/JUnitTest/autoBackups/2019_05_15_00 [main] jmrit.operations.setup.BackupBase.?()
    [junit] INFO  - Max road name (ALTON) length 5 [main] operations.rollingstock.cars.CarRoads.?()
    [junit] INFO  - Max track name (Spur at A-1) at (Test Location A-1) length 9 [main] jmrit.operations.locations.LocationManager.?()
    [junit] INFO  - Max location name (Test Location A-1) length 15 [main] jmrit.operations.locations.LocationManager.?()
    [junit] INFO  - Max location and track name (Test Location A-1, Spur at A-1) length 24 [main] jmrit.operations.locations.LocationManager.?()
    [junit] INFO  - Max car type name (Boxcar) length 6 [main] operations.rollingstock.cars.CarTypes.?()
    [junit] INFO  - Saving copy of operations files to: temp/operations/JUnitTest/autoBackups/2019_05_15_00 [main] jmrit.operations.setup.BackupBase.?()
    [junit] INFO  - Max road name (ALTON) length 5 [main] operations.rollingstock.cars.CarRoads.?()
    [junit] INFO  - Max track name (Spur at A-1) at (Test Location A-1) length 9 [main] jmrit.operations.locations.LocationManager.?()
    [junit] INFO  - Max location name (Test Location A-1) length 15 [main] jmrit.operations.locations.LocationManager.?()
    [junit] INFO  - Max location and track name (Test Location A-1, Spur at A-1) length 24 [main] jmrit.operations.locations.LocationManager.?()
    [junit] INFO  - Max car type name (Boxcar) length 6 [main] operations.rollingstock.cars.CarTypes.?()
    [junit] INFO  - Saving copy of operations files to: temp/operations/JUnitTest/autoBackups/2019_05_15_00 [main] jmrit.operations.setup.BackupBase.?()
    [junit] INFO  - Max road name (ALTON) length 5 [main] operations.rollingstock.cars.CarRoads.?()
    [junit] INFO  - Max track name (Spur at A-1) at (Test Location A-1) length 9 [main] jmrit.operations.locations.LocationManager.?()
    [junit] INFO  - Max location name (Test Location A-1) length 15 [main] jmrit.operations.locations.LocationManager.?()
    [junit] INFO  - Max location and track name (Test Location A-1, Spur at A-1) length 24 [main] jmrit.operations.locations.LocationManager.?()
    [junit] INFO  - Max car type name (Boxcar) length 6 [main] operations.rollingstock.cars.CarTypes.?()
    [junit] INFO  - Saving copy of operations files to: temp/operations/JUnitTest/autoBackups/2019_05_15_00 [main] jmrit.operations.setup.BackupBase.?()
    [junit] INFO  - Max road name (ALTON) length 5 [main] operations.rollingstock.cars.CarRoads.?()
    [junit] INFO  - Max track name (Yard at C) at (Test Location C) length 9 [main] jmrit.operations.locations.LocationManager.?()
    [junit] INFO  - Max location name (Test Location C) length 15 [main] jmrit.operations.locations.LocationManager.?()
    [junit] INFO  - Max location and track name (Test Location C, Yard at C) length 24 [main] jmrit.operations.locations.LocationManager.?()
    [junit] INFO  - Max car type name (Boxcar) length 6 [main] operations.rollingstock.cars.CarTypes.?()
    [junit] INFO  - Saving copy of operations files to: temp/operations/JUnitTest/autoBackups/2019_05_15_00 [main] jmrit.operations.setup.BackupBase.?()
    [junit] INFO  - Saving copy of operations files to: temp/operations/JUnitTest/autoBackups/2019_05_15_00 [main] jmrit.operations.setup.BackupBase.?()
    [junit] INFO  - Saving copy of operations files to: temp/operations/JUnitTest/autoBackups/2019_05_15_00 [main] jmrit.operations.setup.BackupBase.?()
    [junit] INFO  - No temp/operations/JUnitTest/OperationsJUnitTestLocationRoster.xml file to backup [main] jmri.jmrit.XmlFile.?()
    [junit] INFO  - No temp/operations/JUnitTest/OperationsJUnitTestRouteRoster.xml file to backup [main] jmri.jmrit.XmlFile.?()
    [junit] INFO  - No temp/operations/JUnitTest/OperationsJUnitTestCarRoster.xml file to backup [main] jmri.jmrit.XmlFile.?()
    [junit] INFO  - No temp/operations/JUnitTest/OperationsJUnitTestEngineRoster.xml file to backup [main] jmri.jmrit.XmlFile.?()
    [junit] INFO  - No temp/operations/JUnitTest/OperationsJUnitTestTrainRoster.xml file to backup [main] jmri.jmrit.XmlFile.?()
    [junit] INFO  - Saving copy of operations files to: temp/operations/JUnitTest/autoBackups/2019_05_15_00 [main] jmrit.operations.setup.BackupBase.?()
    [junit] INFO  - Saving copy of operations files to: temp/operations/JUnitTest/autoBackups/2019_05_15_00 [main] jmrit.operations.setup.BackupBase.?()
    [junit] INFO  - Saving copy of operations files to: temp/operations/JUnitTest/autoBackups/2019_05_15_00 [main] jmrit.operations.setup.BackupBase.?()
    [junit] INFO  - Saving copy of operations files to: temp/operations/JUnitTest/autoBackups/2019_05_15_00 [main] jmrit.operations.setup.BackupBase.?()
    [junit] INFO  - Max road name (ALTON) length 5 [main] operations.rollingstock.cars.CarRoads.?()
    [junit] INFO  - Max car type name (Caboose) length 7 [main] operations.rollingstock.cars.CarTypes.?()
    [junit] INFO  - Max track name (South End 1) at (South End Staging) length 11 [main] jmrit.operations.locations.LocationManager.?()
    [junit] INFO  - Max location name (South End Staging) length 17 [main] jmrit.operations.locations.LocationManager.?()
    [junit] INFO  - Max location and track name (South End Staging, South End 1) length 28 [main] jmrit.operations.locations.LocationManager.?()
    [junit] INFO  - Saving copy of operations files to: temp/operations/JUnitTest/autoBackups/2019_05_15_00 [main] jmrit.operations.setup.BackupBase.?()
    [junit] INFO  - No temp/operations/JUnitTest/OperationsJUnitTestLocationRoster.xml file to backup [main] jmri.jmrit.XmlFile.?()
    [junit] INFO  - No temp/operations/JUnitTest/OperationsJUnitTestRouteRoster.xml file to backup [main] jmri.jmrit.XmlFile.?()
    [junit] INFO  - No temp/operations/JUnitTest/OperationsJUnitTestCarRoster.xml file to backup [main] jmri.jmrit.XmlFile.?()
    [junit] INFO  - No temp/operations/JUnitTest/OperationsJUnitTestEngineRoster.xml file to backup [main] jmri.jmrit.XmlFile.?()
    [junit] INFO  - No temp/operations/JUnitTest/OperationsJUnitTestTrainRoster.xml file to backup [main] jmri.jmrit.XmlFile.?()
    [junit] INFO  - No temp/operations/JUnitTest/OperationsJUnitTestLocationRoster.xml file to backup [main] jmri.jmrit.XmlFile.?()
    [junit] INFO  - No temp/operations/JUnitTest/OperationsJUnitTestRouteRoster.xml file to backup [main] jmri.jmrit.XmlFile.?()
    [junit] INFO  - No temp/operations/JUnitTest/OperationsJUnitTestCarRoster.xml file to backup [main] jmri.jmrit.XmlFile.?()
    [junit] INFO  - No temp/operations/JUnitTest/OperationsJUnitTestEngineRoster.xml file to backup [main] jmri.jmrit.XmlFile.?()
    [junit] INFO  - No temp/operations/JUnitTest/OperationsJUnitTestTrainRoster.xml file to backup [main] jmri.jmrit.XmlFile.?()
    [junit] INFO  - No temp/operations/JUnitTest/OperationsJUnitTestLocationRoster.xml file to backup [main] jmri.jmrit.XmlFile.?()
    [junit] INFO  - No temp/operations/JUnitTest/OperationsJUnitTestRouteRoster.xml file to backup [main] jmri.jmrit.XmlFile.?()
    [junit] INFO  - No temp/operations/JUnitTest/OperationsJUnitTestCarRoster.xml file to backup [main] jmri.jmrit.XmlFile.?()
    [junit] INFO  - No temp/operations/JUnitTest/OperationsJUnitTestEngineRoster.xml file to backup [main] jmri.jmrit.XmlFile.?()
    [junit] INFO  - No temp/operations/JUnitTest/OperationsJUnitTestTrainRoster.xml file to backup [main] jmri.jmrit.XmlFile.?()
    [junit] INFO  - Max road name (ALTON) length 5 [main] operations.rollingstock.cars.CarRoads.?()
    [junit] INFO  - Max car type name (FlatBulkHead) length 12 [main] operations.rollingstock.cars.CarTypes.?()
    [junit] INFO  - Max track name (South End 1) at (South End Staging) length 11 [main] jmrit.operations.locations.LocationManager.?()
    [junit] INFO  - Max location name (South End Staging) length 17 [main] jmrit.operations.locations.LocationManager.?()
    [junit] INFO  - Max location and track name (South End Staging, South End 1) length 28 [main] jmrit.operations.locations.LocationManager.?()
    [junit] INFO  - Saving copy of operations files to: temp/operations/JUnitTest/autoBackups/2019_05_15_00 [main] jmrit.operations.setup.BackupBase.?()
    [junit] INFO  - Train (STF) has started its route, can not be reset [main] jmrit.operations.trains.Train.?()
    [junit] INFO  - No temp/operations/JUnitTest/OperationsJUnitTestLocationRoster.xml file to backup [main] jmri.jmrit.XmlFile.?()
    [junit] INFO  - No temp/operations/JUnitTest/OperationsJUnitTestRouteRoster.xml file to backup [main] jmri.jmrit.XmlFile.?()
    [junit] INFO  - No temp/operations/JUnitTest/OperationsJUnitTestCarRoster.xml file to backup [main] jmri.jmrit.XmlFile.?()
    [junit] INFO  - No temp/operations/JUnitTest/OperationsJUnitTestEngineRoster.xml file to backup [main] jmri.jmrit.XmlFile.?()
    [junit] INFO  - No temp/operations/JUnitTest/OperationsJUnitTestTrainRoster.xml file to backup [main] jmri.jmrit.XmlFile.?()
    [junit] INFO  - No temp/operations/JUnitTest/OperationsJUnitTestLocationRoster.xml file to backup [main] jmri.jmrit.XmlFile.?()
    [junit] INFO  - No temp/operations/JUnitTest/OperationsJUnitTestRouteRoster.xml file to backup [main] jmri.jmrit.XmlFile.?()
    [junit] INFO  - No temp/operations/JUnitTest/OperationsJUnitTestCarRoster.xml file to backup [main] jmri.jmrit.XmlFile.?()
    [junit] INFO  - No temp/operations/JUnitTest/OperationsJUnitTestEngineRoster.xml file to backup [main] jmri.jmrit.XmlFile.?()
    [junit] INFO  - No temp/operations/JUnitTest/OperationsJUnitTestTrainRoster.xml file to backup [main] jmri.jmrit.XmlFile.?()
    [junit] INFO  - Can not add, train already exists [main] jmrit.operations.trains.TrainEditFrame.?()
    [junit] INFO  - Max road name (ALTON) length 5 [main] operations.rollingstock.cars.CarRoads.?()
    [junit] INFO  - Max track name (South End 1) at (South End) length 11 [main] jmrit.operations.locations.LocationManager.?()
    [junit] INFO  - Max location name (North Industries) length 16 [main] jmrit.operations.locations.LocationManager.?()
    [junit] INFO  - Max location and track name (North Industries, NI Yard) length 23 [main] jmrit.operations.locations.LocationManager.?()
    [junit] INFO  - Saving copy of operations files to: temp/operations/JUnitTest/autoBackups/2019_05_15_00 [main] jmrit.operations.setup.BackupBase.?()
    [junit] INFO  - Max road name (ALTON) length 5 [main] operations.rollingstock.cars.CarRoads.?()
    [junit] INFO  - Max car type name (Caboose) length 7 [main] operations.rollingstock.cars.CarTypes.?()
    [junit] INFO  - Max track name (Chelmsford Interchange 1) at (Chelmsford) length 24 [main] jmrit.operations.locations.LocationManager.?()
    [junit] INFO  - Max location name (Chelmsford) length 10 [main] jmrit.operations.locations.LocationManager.?()
    [junit] INFO  - Max location and track name (Chelmsford, Chelmsford Interchange 1) length 34 [main] jmrit.operations.locations.LocationManager.?()
    [junit] INFO  - Saving copy of operations files to: temp/operations/JUnitTest/autoBackups/2019_05_15_00 [main] jmrit.operations.setup.BackupBase.?()
    [junit] INFO  - Max road name (ALTON) length 5 [main] operations.rollingstock.cars.CarRoads.?()
    [junit] INFO  - Max car type name (Caboose) length 7 [main] operations.rollingstock.cars.CarTypes.?()
    [junit] INFO  - Max track name (Chelmsford Interchange 1) at (Chelmsford) length 24 [main] jmrit.operations.locations.LocationManager.?()
    [junit] INFO  - Max location name (Staging MA) length 10 [main] jmrit.operations.locations.LocationManager.?()
    [junit] INFO  - Max location and track name (Chelmsford, Chelmsford Interchange 1) length 34 [main] jmrit.operations.locations.LocationManager.?()
    [junit] INFO  - Saving copy of operations files to: temp/operations/JUnitTest/autoBackups/2019_05_15_00 [main] jmrit.operations.setup.BackupBase.?()
    [junit] INFO  - Max road name (ALTON) length 5 [main] operations.rollingstock.cars.CarRoads.?()
    [junit] INFO  - Max car type name (Caboose) length 7 [main] operations.rollingstock.cars.CarTypes.?()
    [junit] INFO  - Max track name (Chelmsford Interchange 1) at (Chelmsford) length 24 [main] jmrit.operations.locations.LocationManager.?()
    [junit] INFO  - Max location name (Chelmsford) length 10 [main] jmrit.operations.locations.LocationManager.?()
    [junit] INFO  - Max location and track name (Chelmsford, Chelmsford Interchange 1) length 34 [main] jmrit.operations.locations.LocationManager.?()
    [junit] INFO  - Saving copy of operations files to: temp/operations/JUnitTest/autoBackups/2019_05_15_00 [main] jmrit.operations.setup.BackupBase.?()
    [junit] INFO  - Max road name (ALTON) length 5 [main] operations.rollingstock.cars.CarRoads.?()
    [junit] INFO  - Max car type name (Caboose) length 7 [main] operations.rollingstock.cars.CarTypes.?()
    [junit] INFO  - Max track name (Chelmsford Interchange 1) at (Chelmsford) length 24 [main] jmrit.operations.locations.LocationManager.?()
    [junit] INFO  - Max location name (Chelmsford) length 10 [main] jmrit.operations.locations.LocationManager.?()
    [junit] INFO  - Max location and track name (Chelmsford, Chelmsford Interchange 1) length 34 [main] jmrit.operations.locations.LocationManager.?()
    [junit] INFO  - Saving copy of operations files to: temp/operations/JUnitTest/autoBackups/2019_05_15_00 [main] jmrit.operations.setup.BackupBase.?()
    [junit] INFO  - Max road name (ALTON) length 5 [main] operations.rollingstock.cars.CarRoads.?()
    [junit] INFO  - Max car type name (Caboose) length 7 [main] operations.rollingstock.cars.CarTypes.?()
    [junit] INFO  - Max track name (Chelmsford Interchange 1) at (Chelmsford) length 24 [main] jmrit.operations.locations.LocationManager.?()
    [junit] INFO  - Max location name (Chelmsford) length 10 [main] jmrit.operations.locations.LocationManager.?()
    [junit] INFO  - Max location and track name (Chelmsford, Chelmsford Interchange 1) length 34 [main] jmrit.operations.locations.LocationManager.?()
    [junit] INFO  - Saving copy of operations files to: temp/operations/JUnitTest/autoBackups/2019_05_15_00 [main] jmrit.operations.setup.BackupBase.?()
    [junit] INFO  - Max road name (ALTON) length 5 [main] operations.rollingstock.cars.CarRoads.?()
    [junit] INFO  - Max car type name (Caboose) length 7 [main] operations.rollingstock.cars.CarTypes.?()
    [junit] INFO  - Max track name (Chelmsford Interchange 1) at (Chelmsford) length 24 [main] jmrit.operations.locations.LocationManager.?()
    [junit] INFO  - Max location name (Chelmsford) length 10 [main] jmrit.operations.locations.LocationManager.?()
    [junit] INFO  - Max location and track name (Chelmsford, Chelmsford Interchange 1) length 34 [main] jmrit.operations.locations.LocationManager.?()
    [junit] INFO  - Saving copy of operations files to: temp/operations/JUnitTest/autoBackups/2019_05_15_00 [main] jmrit.operations.setup.BackupBase.?()
    [junit] INFO  - Max road name (ALTON) length 5 [main] operations.rollingstock.cars.CarRoads.?()
    [junit] INFO  - Max car type name (Caboose) length 7 [main] operations.rollingstock.cars.CarTypes.?()
    [junit] INFO  - Max track name (Chelmsford Interchange 1) at (Chelmsford) length 24 [main] jmrit.operations.locations.LocationManager.?()
    [junit] INFO  - Max location name (Chelmsford) length 10 [main] jmrit.operations.locations.LocationManager.?()
    [junit] INFO  - Max location and track name (Chelmsford, Chelmsford Interchange 1) length 34 [main] jmrit.operations.locations.LocationManager.?()
    [junit] INFO  - Saving copy of operations files to: temp/operations/JUnitTest/autoBackups/2019_05_15_00 [main] jmrit.operations.setup.BackupBase.?()
    [junit] INFO  - Max road name (ALTON) length 5 [main] operations.rollingstock.cars.CarRoads.?()
    [junit] INFO  - Max car type name (Caboose) length 7 [main] operations.rollingstock.cars.CarTypes.?()
    [junit] INFO  - Max track name (Chelmsford Interchange 1) at (Chelmsford) length 24 [main] jmrit.operations.locations.LocationManager.?()
    [junit] INFO  - Max location name (Chelmsford) length 10 [main] jmrit.operations.locations.LocationManager.?()
    [junit] INFO  - Max location and track name (Chelmsford, Chelmsford Interchange 1) length 34 [main] jmrit.operations.locations.LocationManager.?()
    [junit] INFO  - Saving copy of operations files to: temp/operations/JUnitTest/autoBackups/2019_05_15_00 [main] jmrit.operations.setup.BackupBase.?()
    [junit] INFO  - Max road name (ALTON) length 5 [main] operations.rollingstock.cars.CarRoads.?()
    [junit] INFO  - Max car type name (Caboose) length 7 [main] operations.rollingstock.cars.CarTypes.?()
    [junit] INFO  - Max track name (Chelmsford Interchange 1) at (Chelmsford) length 24 [main] jmrit.operations.locations.LocationManager.?()
    [junit] INFO  - Max location name (Chelmsford) length 10 [main] jmrit.operations.locations.LocationManager.?()
    [junit] INFO  - Max location and track name (Chelmsford, Chelmsford Interchange 1) length 34 [main] jmrit.operations.locations.LocationManager.?()
    [junit] INFO  - Saving copy of operations files to: temp/operations/JUnitTest/autoBackups/2019_05_15_00 [main] jmrit.operations.setup.BackupBase.?()
    [junit] INFO  - No temp/operations/JUnitTest/OperationsJUnitTestLocationRoster.xml file to backup [main] jmri.jmrit.XmlFile.?()
    [junit] INFO  - No /var/lib/jenkins/jobs/Development/jobs/AllTest/workspace/./temp/operations/JUnitTest/OperationsJUnitTestLocationRoster.xml.bak backup file to revert [main] jmri.jmrit.XmlFile.?()
    [junit] INFO  - No temp/operations/JUnitTest/OperationsJUnitTestLocationRoster.xml file to backup [main] jmri.jmrit.XmlFile.?()
    [junit] INFO  - No temp/operations/JUnitTest/OperationsJUnitTestRouteRoster.xml file to backup [main] jmri.jmrit.XmlFile.?()
    [junit] INFO  - No temp/operations/JUnitTest/OperationsJUnitTestCarRoster.xml file to backup [main] jmri.jmrit.XmlFile.?()
    [junit] INFO  - No temp/operations/JUnitTest/OperationsJUnitTestEngineRoster.xml file to backup [main] jmri.jmrit.XmlFile.?()
    [junit] INFO  - No temp/operations/JUnitTest/OperationsJUnitTestTrainRoster.xml file to backup [main] jmri.jmrit.XmlFile.?()
    [junit] INFO  - No temp/operations/JUnitTest/OperationsJUnitTestLocationRoster.xml file to backup [main] jmri.jmrit.XmlFile.?()
    [junit] INFO  - No temp/operations/JUnitTest/OperationsJUnitTestRouteRoster.xml file to backup [main] jmri.jmrit.XmlFile.?()
    [junit] INFO  - No temp/operations/JUnitTest/OperationsJUnitTestCarRoster.xml file to backup [main] jmri.jmrit.XmlFile.?()
    [junit] INFO  - No temp/operations/JUnitTest/OperationsJUnitTestEngineRoster.xml file to backup [main] jmri.jmrit.XmlFile.?()
    [junit] INFO  - No temp/operations/JUnitTest/OperationsJUnitTestTrainRoster.xml file to backup [main] jmri.jmrit.XmlFile.?()
    [junit] INFO  - No temp/operations/JUnitTest/ExportOperationsLocationRoster.csv file to backup [main] jmri.jmrit.XmlFile.?()
    [junit] INFO  - Exported 5 locations to file temp/operations/JUnitTest/ExportOperationsLocationRoster.csv [main] operations.locations.tools.ExportLocations.?()
    [junit] INFO  - No temp/operations/JUnitTest/OperationsJUnitTestLocationRoster.xml file to backup [main] jmri.jmrit.XmlFile.?()
    [junit] INFO  - No temp/operations/JUnitTest/OperationsJUnitTestLocationRoster.xml file to backup [main] jmri.jmrit.XmlFile.?()
    [junit] INFO  - No temp/operations/JUnitTest/OperationsJUnitTestRouteRoster.xml file to backup [main] jmri.jmrit.XmlFile.?()
    [junit] INFO  - No temp/operations/JUnitTest/OperationsJUnitTestCarRoster.xml file to backup [main] jmri.jmrit.XmlFile.?()
    [junit] INFO  - No temp/operations/JUnitTest/OperationsJUnitTestEngineRoster.xml file to backup [main] jmri.jmrit.XmlFile.?()
    [junit] INFO  - No temp/operations/JUnitTest/OperationsJUnitTestTrainRoster.xml file to backup [main] jmri.jmrit.XmlFile.?()
    [junit] INFO  - No temp/operations/JUnitTest/OperationsJUnitTestLocationRoster.xml file to backup [main] jmri.jmrit.XmlFile.?()
    [junit] INFO  - No temp/operations/JUnitTest/OperationsJUnitTestRouteRoster.xml file to backup [main] jmri.jmrit.XmlFile.?()
    [junit] INFO  - No temp/operations/JUnitTest/OperationsJUnitTestCarRoster.xml file to backup [main] jmri.jmrit.XmlFile.?()
    [junit] INFO  - No temp/operations/JUnitTest/OperationsJUnitTestEngineRoster.xml file to backup [main] jmri.jmrit.XmlFile.?()
    [junit] INFO  - No temp/operations/JUnitTest/OperationsJUnitTestTrainRoster.xml file to backup [main] jmri.jmrit.XmlFile.?()
    [junit] INFO  - No temp/operations/JUnitTest/OperationsJUnitTestLocationRoster.xml file to backup [main] jmri.jmrit.XmlFile.?()
    [junit] INFO  - No temp/operations/JUnitTest/OperationsJUnitTestRouteRoster.xml file to backup [main] jmri.jmrit.XmlFile.?()
    [junit] INFO  - No temp/operations/JUnitTest/OperationsJUnitTestCarRoster.xml file to backup [main] jmri.jmrit.XmlFile.?()
    [junit] INFO  - No temp/operations/JUnitTest/OperationsJUnitTestEngineRoster.xml file to backup [main] jmri.jmrit.XmlFile.?()
    [junit] INFO  - No temp/operations/JUnitTest/OperationsJUnitTestTrainRoster.xml file to backup [main] jmri.jmrit.XmlFile.?()
    [junit] INFO  - No temp/operations/JUnitTest/OperationsJUnitTestLocationRoster.xml file to backup [main] jmri.jmrit.XmlFile.?()
    [junit] INFO  - No temp/operations/JUnitTest/OperationsJUnitTestLocationRoster.xml file to backup [main] jmri.jmrit.XmlFile.?()
    [junit] INFO  - No temp/operations/JUnitTest/OperationsJUnitTestLocationRoster.xml file to backup [main] jmri.jmrit.XmlFile.?()
    [junit] INFO  - No temp/operations/JUnitTest/OperationsJUnitTestRouteRoster.xml file to backup [main] jmri.jmrit.XmlFile.?()
    [junit] INFO  - No temp/operations/JUnitTest/OperationsJUnitTestCarRoster.xml file to backup [main] jmri.jmrit.XmlFile.?()
    [junit] INFO  - No temp/operations/JUnitTest/OperationsJUnitTestEngineRoster.xml file to backup [main] jmri.jmrit.XmlFile.?()
    [junit] INFO  - No temp/operations/JUnitTest/OperationsJUnitTestTrainRoster.xml file to backup [main] jmri.jmrit.XmlFile.?()
    [junit] INFO  - No temp/operations/JUnitTest/OperationsJUnitTestLocationRoster.xml file to backup [main] jmri.jmrit.XmlFile.?()
    [junit] INFO  - No temp/operations/JUnitTest/OperationsJUnitTestRouteRoster.xml file to backup [main] jmri.jmrit.XmlFile.?()
    [junit] INFO  - No temp/operations/JUnitTest/OperationsJUnitTestCarRoster.xml file to backup [main] jmri.jmrit.XmlFile.?()
    [junit] INFO  - No temp/operations/JUnitTest/OperationsJUnitTestEngineRoster.xml file to backup [main] jmri.jmrit.XmlFile.?()
    [junit] INFO  - No temp/operations/JUnitTest/OperationsJUnitTestTrainRoster.xml file to backup [main] jmri.jmrit.XmlFile.?()
    [junit] INFO  - No temp/operations/JUnitTest/OperationsJUnitTestLocationRoster.xml file to backup [main] jmri.jmrit.XmlFile.?()
    [junit] INFO  - No temp/operations/JUnitTest/OperationsJUnitTestRouteRoster.xml file to backup [main] jmri.jmrit.XmlFile.?()
    [junit] INFO  - No temp/operations/JUnitTest/OperationsJUnitTestCarRoster.xml file to backup [main] jmri.jmrit.XmlFile.?()
    [junit] INFO  - No temp/operations/JUnitTest/OperationsJUnitTestEngineRoster.xml file to backup [main] jmri.jmrit.XmlFile.?()
    [junit] INFO  - No temp/operations/JUnitTest/OperationsJUnitTestTrainRoster.xml file to backup [main] jmri.jmrit.XmlFile.?()
    [junit] INFO  - No temp/operations/JUnitTest/OperationsJUnitTestLocationRoster.xml file to backup [main] jmri.jmrit.XmlFile.?()
    [junit] INFO  - No temp/operations/JUnitTest/OperationsJUnitTestRouteRoster.xml file to backup [main] jmri.jmrit.XmlFile.?()
    [junit] INFO  - No temp/operations/JUnitTest/OperationsJUnitTestCarRoster.xml file to backup [main] jmri.jmrit.XmlFile.?()
    [junit] INFO  - No temp/operations/JUnitTest/OperationsJUnitTestEngineRoster.xml file to backup [main] jmri.jmrit.XmlFile.?()
    [junit] INFO  - No temp/operations/JUnitTest/OperationsJUnitTestTrainRoster.xml file to backup [main] jmri.jmrit.XmlFile.?()
    [junit] INFO  - No temp/operations/JUnitTest/OperationsJUnitTestLocationRoster.xml file to backup [main] jmri.jmrit.XmlFile.?()
    [junit] INFO  - No temp/operations/JUnitTest/OperationsJUnitTestLocationRoster.xml file to backup [main] jmri.jmrit.XmlFile.?()
    [junit] INFO  - No temp/operations/JUnitTest/OperationsJUnitTestRouteRoster.xml file to backup [main] jmri.jmrit.XmlFile.?()
    [junit] INFO  - No temp/operations/JUnitTest/OperationsJUnitTestCarRoster.xml file to backup [main] jmri.jmrit.XmlFile.?()
    [junit] INFO  - No temp/operations/JUnitTest/OperationsJUnitTestEngineRoster.xml file to backup [main] jmri.jmrit.XmlFile.?()
    [junit] INFO  - No temp/operations/JUnitTest/OperationsJUnitTestTrainRoster.xml file to backup [main] jmri.jmrit.XmlFile.?()
    [junit] INFO  - Max car type name (Caboose) length 7 [main] operations.rollingstock.cars.CarTypes.?()
    [junit] INFO  - Max track name (TEST_LOCATION Interchange 1) at (TEST_LOCATION) length 27 [main] jmrit.operations.locations.LocationManager.?()
    [junit] INFO  - Max location name (South End Staging) length 17 [main] jmrit.operations.locations.LocationManager.?()
    [junit] INFO  - Max location and track name (TEST_LOCATION, TEST_LOCATION Interchange 1) length 40 [main] jmrit.operations.locations.LocationManager.?()
    [junit] INFO  - Max road name (ALTON) length 5 [main] operations.rollingstock.cars.CarRoads.?()
    [junit] INFO  - No temp/operations/JUnitTest/ExportOperationsSchedules.csv file to backup [main] jmri.jmrit.XmlFile.?()
    [junit] INFO  - Exported 1 schedules to file temp/operations/JUnitTest/ExportOperationsSchedules.csv [main] operations.locations.tools.ExportLocations.?()
    [junit] INFO  - No temp/operations/JUnitTest/OperationsJUnitTestLocationRoster.xml file to backup [main] jmri.jmrit.XmlFile.?()
    [junit] INFO  - No temp/operations/JUnitTest/OperationsJUnitTestTrainRoster.xml file to backup [main] jmri.jmrit.XmlFile.?()
    [junit] INFO  - No temp/operations/JUnitTest/OperationsJUnitTestLocationRoster.xml file to backup [main] jmri.jmrit.XmlFile.?()
    [junit] INFO  - No temp/operations/JUnitTest/OperationsJUnitTestRouteRoster.xml file to backup [main] jmri.jmrit.XmlFile.?()
    [junit] INFO  - No temp/operations/JUnitTest/OperationsJUnitTestCarRoster.xml file to backup [main] jmri.jmrit.XmlFile.?()
    [junit] INFO  - No temp/operations/JUnitTest/OperationsJUnitTestTrainRoster.xml file to backup [main] jmri.jmrit.XmlFile.?()
    [junit] INFO  - No temp/operations/JUnitTest/OperationsJUnitTestLocationRoster.xml file to backup [main] jmri.jmrit.XmlFile.?()
    [junit] INFO  - No temp/operations/JUnitTest/OperationsJUnitTestRouteRoster.xml file to backup [main] jmri.jmrit.XmlFile.?()
    [junit] INFO  - No temp/operations/JUnitTest/OperationsJUnitTestCarRoster.xml file to backup [main] jmri.jmrit.XmlFile.?()
    [junit] INFO  - No temp/operations/JUnitTest/OperationsJUnitTestTrainRoster.xml file to backup [main] jmri.jmrit.XmlFile.?()
    [junit] INFO  - No temp/operations/JUnitTest/OperationsJUnitTestLocationRoster.xml file to backup [main] jmri.jmrit.XmlFile.?()
    [junit] INFO  - No temp/operations/JUnitTest/OperationsJUnitTestRouteRoster.xml file to backup [main] jmri.jmrit.XmlFile.?()
    [junit] INFO  - No temp/operations/JUnitTest/OperationsJUnitTestCarRoster.xml file to backup [main] jmri.jmrit.XmlFile.?()
    [junit] INFO  - No temp/operations/JUnitTest/OperationsJUnitTestTrainRoster.xml file to backup [main] jmri.jmrit.XmlFile.?()
    [junit] INFO  - No temp/operations/JUnitTest/OperationsJUnitTestLocationRoster.xml file to backup [main] jmri.jmrit.XmlFile.?()
    [junit] INFO  - No temp/operations/JUnitTest/OperationsJUnitTestRouteRoster.xml file to backup [main] jmri.jmrit.XmlFile.?()
    [junit] INFO  - No temp/operations/JUnitTest/OperationsJUnitTestCarRoster.xml file to backup [main] jmri.jmrit.XmlFile.?()
    [junit] INFO  - No temp/operations/JUnitTest/OperationsJUnitTestTrainRoster.xml file to backup [main] jmri.jmrit.XmlFile.?()
    [junit] INFO  - No temp/operations/JUnitTest/OperationsJUnitTestLocationRoster.xml file to backup [main] jmri.jmrit.XmlFile.?()
    [junit] INFO  - No temp/operations/JUnitTest/OperationsJUnitTestLocationRoster.xml file to backup [main] jmri.jmrit.XmlFile.?()
    [junit] INFO  - No temp/operations/JUnitTest/OperationsJUnitTestRouteRoster.xml file to backup [main] jmri.jmrit.XmlFile.?()
    [junit] INFO  - No temp/operations/JUnitTest/OperationsJUnitTestTrainRoster.xml file to backup [main] jmri.jmrit.XmlFile.?()
    [junit] INFO  - No temp/operations/JUnitTest/OperationsJUnitTestLocationRoster.xml file to backup [main] jmri.jmrit.XmlFile.?()
    [junit] INFO  - No temp/operations/JUnitTest/OperationsJUnitTestRouteRoster.xml file to backup [main] jmri.jmrit.XmlFile.?()
    [junit] INFO  - No temp/operations/JUnitTest/OperationsJUnitTestTrainRoster.xml file to backup [main] jmri.jmrit.XmlFile.?()
    [junit] INFO  - No temp/operations/JUnitTest/OperationsJUnitTestLocationRoster.xml file to backup [main] jmri.jmrit.XmlFile.?()
    [junit] INFO  - No temp/operations/JUnitTest/OperationsJUnitTestRouteRoster.xml file to backup [main] jmri.jmrit.XmlFile.?()
    [junit] INFO  - No temp/operations/JUnitTest/OperationsJUnitTestTrainRoster.xml file to backup [main] jmri.jmrit.XmlFile.?()
    [junit] INFO  - No temp/operations/JUnitTest/OperationsJUnitTestLocationRoster.xml file to backup [main] jmri.jmrit.XmlFile.?()
    [junit] INFO  - No temp/operations/JUnitTest/OperationsJUnitTestRouteRoster.xml file to backup [main] jmri.jmrit.XmlFile.?()
    [junit] INFO  - No temp/operations/JUnitTest/OperationsJUnitTestTrainRoster.xml file to backup [main] jmri.jmrit.XmlFile.?()
    [junit] INFO  - Can not add, track already exists [main] jmrit.operations.locations.TrackEditFrame.?()
    [junit] INFO  - No temp/operations/JUnitTest/OperationsJUnitTestLocationRoster.xml file to backup [main] jmri.jmrit.XmlFile.?()
    [junit] INFO  - No temp/operations/JUnitTest/OperationsJUnitTestRouteRoster.xml file to backup [main] jmri.jmrit.XmlFile.?()
    [junit] INFO  - No temp/operations/JUnitTest/OperationsJUnitTestTrainRoster.xml file to backup [main] jmri.jmrit.XmlFile.?()
    [junit] INFO  - No temp/operations/JUnitTest/OperationsJUnitTestLocationRoster.xml file to backup [main] jmri.jmrit.XmlFile.?()
    [junit] INFO  - No temp/operations/JUnitTest/OperationsJUnitTestRouteRoster.xml file to backup [main] jmri.jmrit.XmlFile.?()
    [junit] INFO  - No temp/operations/JUnitTest/OperationsJUnitTestTrainRoster.xml file to backup [main] jmri.jmrit.XmlFile.?()
    [junit] INFO  - No temp/operations/JUnitTest/OperationsJUnitTestLocationRoster.xml file to backup [main] jmri.jmrit.XmlFile.?()
    [junit] INFO  - No temp/operations/JUnitTest/OperationsJUnitTestRouteRoster.xml file to backup [main] jmri.jmrit.XmlFile.?()
    [junit] INFO  - No temp/operations/JUnitTest/OperationsJUnitTestTrainRoster.xml file to backup [main] jmri.jmrit.XmlFile.?()
    [junit] INFO  - No temp/operations/JUnitTest/OperationsJUnitTestLocationRoster.xml file to backup [main] jmri.jmrit.XmlFile.?()
    [junit] INFO  - No temp/operations/JUnitTest/OperationsJUnitTestRouteRoster.xml file to backup [main] jmri.jmrit.XmlFile.?()
    [junit] INFO  - No temp/operations/JUnitTest/OperationsJUnitTestTrainRoster.xml file to backup [main] jmri.jmrit.XmlFile.?()
    [junit] INFO  - No temp/operations/JUnitTest/OperationsJUnitTestLocationRoster.xml file to backup [main] jmri.jmrit.XmlFile.?()
    [junit] INFO  - No temp/operations/JUnitTest/OperationsJUnitTestRouteRoster.xml file to backup [main] jmri.jmrit.XmlFile.?()
    [junit] INFO  - No temp/operations/JUnitTest/OperationsJUnitTestTrainRoster.xml file to backup [main] jmri.jmrit.XmlFile.?()
    [junit] INFO  - No temp/operations/JUnitTest/OperationsJUnitTestLocationRoster.xml file to backup [main] jmri.jmrit.XmlFile.?()
    [junit] INFO  - No temp/operations/JUnitTest/OperationsJUnitTestRouteRoster.xml file to backup [main] jmri.jmrit.XmlFile.?()
    [junit] INFO  - No temp/operations/JUnitTest/OperationsJUnitTestTrainRoster.xml file to backup [main] jmri.jmrit.XmlFile.?()
    [junit] INFO  - No temp/operations/JUnitTest/OperationsJUnitTestLocationRoster.xml file to backup [main] jmri.jmrit.XmlFile.?()
    [junit] INFO  - No temp/operations/JUnitTest/OperationsJUnitTestRouteRoster.xml file to backup [main] jmri.jmrit.XmlFile.?()
    [junit] INFO  - No temp/operations/JUnitTest/OperationsJUnitTestTrainRoster.xml file to backup [main] jmri.jmrit.XmlFile.?()
    [junit] INFO  - Saving copy of operations files to: temp/operations/JUnitTest/autoBackups/2019_05_15_00 [main] jmrit.operations.setup.BackupBase.?()
    [junit] INFO  - Saving copy of operations files to: temp/operations/JUnitTest/autoBackups/2019_05_15_00 [main] jmrit.operations.setup.BackupBase.?()
    [junit] INFO  - Saving copy of operations files to: temp/operations/JUnitTest/autoBackups/2019_05_15_00 [main] jmrit.operations.setup.BackupBase.?()
    [junit] INFO  - Saving copy of operations files to: temp/operations/JUnitTest/autoBackups/2019_05_15_00 [main] jmrit.operations.setup.BackupBase.?()
    [junit] INFO  - Max road name (ALTON) length 5 [main] operations.rollingstock.cars.CarRoads.?()
    [junit] INFO  - Max car type name (Caboose) length 7 [main] operations.rollingstock.cars.CarTypes.?()
    [junit] INFO  - Max track name (South End 1) at (South End Staging) length 11 [main] jmrit.operations.locations.LocationManager.?()
    [junit] INFO  - Max location name (South End Staging) length 17 [main] jmrit.operations.locations.LocationManager.?()
    [junit] INFO  - Max location and track name (South End Staging, South End 1) length 28 [main] jmrit.operations.locations.LocationManager.?()
    [junit] INFO  - Saving copy of operations files to: temp/operations/JUnitTest/autoBackups/2019_05_15_00 [main] jmrit.operations.setup.BackupBase.?()
    [junit] INFO  - Max road name (ALTON) length 5 [main] operations.rollingstock.cars.CarRoads.?()
    [junit] INFO  - Max car type name (Caboose) length 7 [main] operations.rollingstock.cars.CarTypes.?()
    [junit] INFO  - Max track name (South End 1) at (South End Staging) length 11 [main] jmrit.operations.locations.LocationManager.?()
    [junit] INFO  - Max location name (South End Staging) length 17 [main] jmrit.operations.locations.LocationManager.?()
    [junit] INFO  - Max location and track name (South End Staging, South End 1) length 28 [main] jmrit.operations.locations.LocationManager.?()
    [junit] INFO  - Saving copy of operations files to: temp/operations/JUnitTest/autoBackups/2019_05_15_00 [main] jmrit.operations.setup.BackupBase.?()
    [junit] INFO  - No temp/operations/JUnitTest/OperationsJUnitTestTrainRoster.xml file to backup [main] jmri.jmrit.XmlFile.?()
    [junit] INFO  - Max road name (ALTON) length 5 [main] operations.rollingstock.cars.CarRoads.?()
    [junit] INFO  - Max car type name (Caboose) length 7 [main] operations.rollingstock.cars.CarTypes.?()
    [junit] INFO  - Max track name (South End 1) at (South End Staging) length 11 [main] jmrit.operations.locations.LocationManager.?()
    [junit] INFO  - Max location name (South End Staging) length 17 [main] jmrit.operations.locations.LocationManager.?()
    [junit] INFO  - Max location and track name (South End Staging, South End 1) length 28 [main] jmrit.operations.locations.LocationManager.?()
    [junit] INFO  - Saving copy of operations files to: temp/operations/JUnitTest/autoBackups/2019_05_15_00 [main] jmrit.operations.setup.BackupBase.?()
    [junit] INFO  - Max road name (ALTON) length 5 [main] operations.rollingstock.cars.CarRoads.?()
    [junit] INFO  - Max car type name (Caboose) length 7 [main] operations.rollingstock.cars.CarTypes.?()
    [junit] INFO  - Max track name (South End 1) at (South End Staging) length 11 [main] jmrit.operations.locations.LocationManager.?()
    [junit] INFO  - Max location name (South End Staging) length 17 [main] jmrit.operations.locations.LocationManager.?()
    [junit] INFO  - Max location and track name (South End Staging, South End 1) length 28 [main] jmrit.operations.locations.LocationManager.?()
    [junit] INFO  - Saving copy of operations files to: temp/operations/JUnitTest/autoBackups/2019_05_15_00 [main] jmrit.operations.setup.BackupBase.?()
    [junit] INFO  - Max road name (ALTON) length 5 [main] operations.rollingstock.cars.CarRoads.?()
    [junit] INFO  - Max car type name (Caboose) length 7 [main] operations.rollingstock.cars.CarTypes.?()
    [junit] INFO  - Max track name (South End 1) at (South End Staging) length 11 [main] jmrit.operations.locations.LocationManager.?()
    [junit] INFO  - Max location name (South End Staging) length 17 [main] jmrit.operations.locations.LocationManager.?()
    [junit] INFO  - Max location and track name (South End Staging, South End 1) length 28 [main] jmrit.operations.locations.LocationManager.?()
    [junit] INFO  - Saving copy of operations files to: temp/operations/JUnitTest/autoBackups/2019_05_15_00 [main] jmrit.operations.setup.BackupBase.?()
    [junit] INFO  - Max road name (ALTON) length 5 [main] operations.rollingstock.cars.CarRoads.?()
    [junit] INFO  - Max car type name (Caboose) length 7 [main] operations.rollingstock.cars.CarTypes.?()
    [junit] INFO  - Max track name (South End 1) at (South End Staging) length 11 [main] jmrit.operations.locations.LocationManager.?()
    [junit] INFO  - Max location name (South End Staging) length 17 [main] jmrit.operations.locations.LocationManager.?()
    [junit] INFO  - Max location and track name (South End Staging, South End 1) length 28 [main] jmrit.operations.locations.LocationManager.?()
    [junit] INFO  - Saving copy of operations files to: temp/operations/JUnitTest/autoBackups/2019_05_15_00 [main] jmrit.operations.setup.BackupBase.?()
    [junit] INFO  - Max road name (ALTON) length 5 [main] operations.rollingstock.cars.CarRoads.?()
    [junit] INFO  - Max car type name (Caboose) length 7 [main] operations.rollingstock.cars.CarTypes.?()
    [junit] INFO  - Max track name (South End 1) at (South End Staging) length 11 [main] jmrit.operations.locations.LocationManager.?()
    [junit] INFO  - Max location name (South End Staging) length 17 [main] jmrit.operations.locations.LocationManager.?()
    [junit] INFO  - Max location and track name (South End Staging, South End 1) length 28 [main] jmrit.operations.locations.LocationManager.?()
    [junit] INFO  - Saving copy of operations files to: temp/operations/JUnitTest/autoBackups/2019_05_15_00 [main] jmrit.operations.setup.BackupBase.?()
    [junit] INFO  - Max road name (ALTON) length 5 [main] operations.rollingstock.cars.CarRoads.?()
    [junit] INFO  - Max car type name (Caboose) length 7 [main] operations.rollingstock.cars.CarTypes.?()
    [junit] INFO  - Max track name (South End 1) at (South End Staging) length 11 [main] jmrit.operations.locations.LocationManager.?()
    [junit] INFO  - Max location name (South End Staging) length 17 [main] jmrit.operations.locations.LocationManager.?()
    [junit] INFO  - Max location and track name (South End Staging, South End 1) length 28 [main] jmrit.operations.locations.LocationManager.?()
    [junit] INFO  - Saving copy of operations files to: temp/operations/JUnitTest/autoBackups/2019_05_15_00 [main] jmrit.operations.setup.BackupBase.?()
    [junit] INFO  - Max road name (ALTON) length 5 [main] operations.rollingstock.cars.CarRoads.?()
    [junit] INFO  - Max car type name (Caboose) length 7 [main] operations.rollingstock.cars.CarTypes.?()
    [junit] INFO  - Max track name (South End 1) at (South End Staging) length 11 [main] jmrit.operations.locations.LocationManager.?()
    [junit] INFO  - Max location name (South End Staging) length 17 [main] jmrit.operations.locations.LocationManager.?()
    [junit] INFO  - Max location and track name (South End Staging, South End 1) length 28 [main] jmrit.operations.locations.LocationManager.?()
    [junit] INFO  - Saving copy of operations files to: temp/operations/JUnitTest/autoBackups/2019_05_15_00 [main] jmrit.operations.setup.BackupBase.?()
    [junit] INFO  - Max road name (ALTON) length 5 [main] operations.rollingstock.cars.CarRoads.?()
    [junit] INFO  - Max car type name (Caboose) length 7 [main] operations.rollingstock.cars.CarTypes.?()
    [junit] INFO  - Max track name (South End 1) at (South End Staging) length 11 [main] jmrit.operations.locations.LocationManager.?()
    [junit] INFO  - Max location name (South End Staging) length 17 [main] jmrit.operations.locations.LocationManager.?()
    [junit] INFO  - Max location and track name (South End Staging, South End 1) length 28 [main] jmrit.operations.locations.LocationManager.?()
    [junit] INFO  - Saving copy of operations files to: temp/operations/JUnitTest/autoBackups/2019_05_15_00 [main] jmrit.operations.setup.BackupBase.?()
    [junit] INFO  - Max road name (ALTON) length 5 [main] operations.rollingstock.cars.CarRoads.?()
    [junit] INFO  - Max car type name (Caboose) length 7 [main] operations.rollingstock.cars.CarTypes.?()
    [junit] INFO  - Max track name (South End 1) at (South End Staging) length 11 [main] jmrit.operations.locations.LocationManager.?()
    [junit] INFO  - Max location name (South End Staging) length 17 [main] jmrit.operations.locations.LocationManager.?()
    [junit] INFO  - Max location and track name (South End Staging, South End 1) length 28 [main] jmrit.operations.locations.LocationManager.?()
    [junit] INFO  - Saving copy of operations files to: temp/operations/JUnitTest/autoBackups/2019_05_15_00 [main] jmrit.operations.setup.BackupBase.?()
    [junit] INFO  - Max road name (ALTON) length 5 [main] operations.rollingstock.cars.CarRoads.?()
    [junit] INFO  - Max car type name (Caboose) length 7 [main] operations.rollingstock.cars.CarTypes.?()
    [junit] INFO  - Max track name (South End 1) at (South End Staging) length 11 [main] jmrit.operations.locations.LocationManager.?()
    [junit] INFO  - Max location name (South End Staging) length 17 [main] jmrit.operations.locations.LocationManager.?()
    [junit] INFO  - Max location and track name (South End Staging, South End 1) length 28 [main] jmrit.operations.locations.LocationManager.?()
    [junit] INFO  - Saving copy of operations files to: temp/operations/JUnitTest/autoBackups/2019_05_15_00 [main] jmrit.operations.setup.BackupBase.?()
    [junit] INFO  - Max road name (ALTON) length 5 [main] operations.rollingstock.cars.CarRoads.?()
    [junit] INFO  - Max car type name (Caboose) length 7 [main] operations.rollingstock.cars.CarTypes.?()
    [junit] INFO  - Max track name (South End 1) at (South End Staging) length 11 [main] jmrit.operations.locations.LocationManager.?()
    [junit] INFO  - Max location name (South End Staging) length 17 [main] jmrit.operations.locations.LocationManager.?()
    [junit] INFO  - Max location and track name (South End Staging, South End 1) length 28 [main] jmrit.operations.locations.LocationManager.?()
    [junit] INFO  - Saving copy of operations files to: temp/operations/JUnitTest/autoBackups/2019_05_15_00 [main] jmrit.operations.setup.BackupBase.?()
    [junit] INFO  - Max road name (ALTON) length 5 [main] operations.rollingstock.cars.CarRoads.?()
    [junit] INFO  - Max car type name (Caboose) length 7 [main] operations.rollingstock.cars.CarTypes.?()
    [junit] INFO  - Max track name (South End 1) at (South End Staging) length 11 [main] jmrit.operations.locations.LocationManager.?()
    [junit] INFO  - Max location name (South End Staging) length 17 [main] jmrit.operations.locations.LocationManager.?()
    [junit] INFO  - Max location and track name (South End Staging, South End 1) length 28 [main] jmrit.operations.locations.LocationManager.?()
    [junit] INFO  - Saving copy of operations files to: temp/operations/JUnitTest/autoBackups/2019_05_15_00 [main] jmrit.operations.setup.BackupBase.?()
    [junit] INFO  - Train (STF) has started its route, can not be reset [main] jmrit.operations.trains.Train.?()
    [junit] INFO  - Max road name (ALTON) length 5 [main] operations.rollingstock.cars.CarRoads.?()
    [junit] INFO  - Max car type name (Caboose) length 7 [main] operations.rollingstock.cars.CarTypes.?()
    [junit] INFO  - Max track name (South End 1) at (South End Staging) length 11 [main] jmrit.operations.locations.LocationManager.?()
    [junit] INFO  - Max location name (South End Staging) length 17 [main] jmrit.operations.locations.LocationManager.?()
    [junit] INFO  - Max location and track name (South End Staging, South End 1) length 28 [main] jmrit.operations.locations.LocationManager.?()
    [junit] INFO  - Saving copy of operations files to: temp/operations/JUnitTest/autoBackups/2019_05_15_00 [main] jmrit.operations.setup.BackupBase.?()
    [junit] INFO  - Max road name (ALTON) length 5 [main] operations.rollingstock.cars.CarRoads.?()
    [junit] INFO  - Max car type name (Caboose) length 7 [main] operations.rollingstock.cars.CarTypes.?()
    [junit] INFO  - Max track name (South End 1) at (South End Staging) length 11 [main] jmrit.operations.locations.LocationManager.?()
    [junit] INFO  - Max location name (South End Staging) length 17 [main] jmrit.operations.locations.LocationManager.?()
    [junit] INFO  - Max location and track name (South End Staging, South End 1) length 28 [main] jmrit.operations.locations.LocationManager.?()
    [junit] INFO  - Saving copy of operations files to: temp/operations/JUnitTest/autoBackups/2019_05_15_00 [main] jmrit.operations.setup.BackupBase.?()
    [junit] INFO  - Max road name (ALTON) length 5 [main] operations.rollingstock.cars.CarRoads.?()
    [junit] INFO  - Max car type name (Caboose) length 7 [main] operations.rollingstock.cars.CarTypes.?()
    [junit] INFO  - Max track name (South End 1) at (South End Staging) length 11 [main] jmrit.operations.locations.LocationManager.?()
    [junit] INFO  - Max location name (South End Staging) length 17 [main] jmrit.operations.locations.LocationManager.?()
    [junit] INFO  - Max location and track name (South End Staging, South End 1) length 28 [main] jmrit.operations.locations.LocationManager.?()
    [junit] INFO  - Saving copy of operations files to: temp/operations/JUnitTest/autoBackups/2019_05_15_00 [main] jmrit.operations.setup.BackupBase.?()
    [junit] INFO  - Max road name (ALTON) length 5 [main] operations.rollingstock.cars.CarRoads.?()
    [junit] INFO  - Max car type name (Caboose) length 7 [main] operations.rollingstock.cars.CarTypes.?()
    [junit] INFO  - Max track name (South End 1) at (South End Staging) length 11 [main] jmrit.operations.locations.LocationManager.?()
    [junit] INFO  - Max location name (South End Staging) length 17 [main] jmrit.operations.locations.LocationManager.?()
    [junit] INFO  - Max location and track name (South End Staging, South End 1) length 28 [main] jmrit.operations.locations.LocationManager.?()
    [junit] INFO  - Saving copy of operations files to: temp/operations/JUnitTest/autoBackups/2019_05_15_00 [main] jmrit.operations.setup.BackupBase.?()
    [junit] INFO  - Max road name (ALTON) length 5 [main] operations.rollingstock.cars.CarRoads.?()
    [junit] INFO  - Max car type name (Caboose) length 7 [main] operations.rollingstock.cars.CarTypes.?()
    [junit] INFO  - Max track name (South End 1) at (South End Staging) length 11 [main] jmrit.operations.locations.LocationManager.?()
    [junit] INFO  - Max location name (South End Staging) length 17 [main] jmrit.operations.locations.LocationManager.?()
    [junit] INFO  - Max location and track name (South End Staging, South End 1) length 28 [main] jmrit.operations.locations.LocationManager.?()
    [junit] INFO  - Saving copy of operations files to: temp/operations/JUnitTest/autoBackups/2019_05_15_00 [main] jmrit.operations.setup.BackupBase.?()
    [junit] INFO  - Max road name (ALTON) length 5 [main] operations.rollingstock.cars.CarRoads.?()
    [junit] INFO  - Max car type name (Caboose) length 7 [main] operations.rollingstock.cars.CarTypes.?()
    [junit] INFO  - Max track name (South End 1) at (South End Staging) length 11 [main] jmrit.operations.locations.LocationManager.?()
    [junit] INFO  - Max location name (South End Staging) length 17 [main] jmrit.operations.locations.LocationManager.?()
    [junit] INFO  - Max location and track name (South End Staging, South End 1) length 28 [main] jmrit.operations.locations.LocationManager.?()
    [junit] INFO  - Saving copy of operations files to: temp/operations/JUnitTest/autoBackups/2019_05_15_00 [main] jmrit.operations.setup.BackupBase.?()
    [junit] INFO  - No temp/operations/JUnitTest/OperationsJUnitTestTrainRoster.xml file to backup [main] jmri.jmrit.XmlFile.?()
    [junit] INFO  - No temp/operations/JUnitTest/OperationsJUnitTestTrainRoster.xml file to backup [main] jmri.jmrit.XmlFile.?()
    [junit] INFO  - Saving copy of operations files to: temp/operations/JUnitTest/autoBackups/2019_05_15_00 [main] jmrit.operations.setup.BackupBase.?()
    [junit] INFO  - No power manager instance found, panel not active [main] jmri.jmrit.throttle.PowerManagerButton.?()
    [junit] INFO  - read CV: 29 mode: Paged will read 0 [main] jmri.progdebugger.ProgDebugger.?()
    [junit] INFO  - read CV: 1 mode: Paged will read 3 [main] jmri.progdebugger.ProgDebugger.?()
    [junit] INFO  - read CV: 7 mode: Paged will read 45 [main] jmri.progdebugger.ProgDebugger.?()
    [junit] INFO  - read CV: 8 mode: Paged will read 127 [main] jmri.progdebugger.ProgDebugger.?()
    [junit] INFO  - No power manager instance found, panel not active [main] jmri.jmrit.throttle.PowerManagerButton.?()
    [junit] INFO  - No power manager instance found, panel not active [main] jmri.jmrit.throttle.PowerManagerButton.?()
    [junit] INFO  - read CV: 29 mode: Paged will read 0 [main] jmri.progdebugger.ProgDebugger.?()
    [junit] INFO  - read CV: 1 mode: Paged will read 3 [main] jmri.progdebugger.ProgDebugger.?()
    [junit] INFO  - read CV: 7 mode: Paged will read 123 [main] jmri.progdebugger.ProgDebugger.?()
    [junit] INFO  - read CV: 8 mode: Paged will read 123 [main] jmri.progdebugger.ProgDebugger.?()
    [junit] INFO  - No power manager instance found, panel not active [main] jmri.jmrit.throttle.PowerManagerButton.?()
    [junit] INFO  - read CV: 29 mode: Paged will read 0 [main] jmri.progdebugger.ProgDebugger.?()
    [junit] INFO  - read CV: 1 mode: Paged will read 3 [main] jmri.progdebugger.ProgDebugger.?()
    [junit] INFO  - read CV: 7 mode: Paged will read 45 [main] jmri.progdebugger.ProgDebugger.?()
    [junit] INFO  - read CV: 8 mode: Paged will read 127 [main] jmri.progdebugger.ProgDebugger.?()
    [junit] INFO  - No power manager instance found, panel not active [main] jmri.jmrit.throttle.PowerManagerButton.?()
    [junit] INFO  - No power manager instance found, panel not active [main] jmri.jmrit.throttle.PowerManagerButton.?()
    [junit] INFO  - write CV: 17 to: 21 mode: Paged [main] jmri.progdebugger.ProgDebugger.?()
    [junit] INFO  - write CV: 18 to: 22 mode: Paged [main] jmri.progdebugger.ProgDebugger.?()
    [junit] INFO  - write CV: 19 to: 23 mode: Paged [main] jmri.progdebugger.ProgDebugger.?()
    [junit] INFO  - read CV: 17 mode: Paged will read 123 [main] jmri.progdebugger.ProgDebugger.?()
    [junit] INFO  - read CV: 19 mode: Paged will read 123 [main] jmri.progdebugger.ProgDebugger.?()
    [junit] INFO  - read CV: 18 mode: Paged will read 123 [main] jmri.progdebugger.ProgDebugger.?()
    [junit] INFO  - read CV: 81 mode: Paged will read 123 [main] jmri.progdebugger.ProgDebugger.?()
    [junit] INFO  - write CV: 81 to: 149 mode: Paged [main] jmri.progdebugger.ProgDebugger.?()
    [junit] INFO  - write CV: 81 to: 23 mode: Paged [main] jmri.progdebugger.ProgDebugger.?()
    [junit] INFO  - write CV: 81 to: 23 mode: Paged [main] jmri.progdebugger.ProgDebugger.?()
    [junit] INFO  - read CV: 81 mode: Paged will read 123 [main] jmri.progdebugger.ProgDebugger.?()
    [junit] INFO  - write CV: 81 to: 149 mode: Paged [main] jmri.progdebugger.ProgDebugger.?()
    [junit] INFO  - write CV: 81 to: 23 mode: Paged [main] jmri.progdebugger.ProgDebugger.?()
    [junit] INFO  - write CV: 81 to: 23 mode: Paged [main] jmri.progdebugger.ProgDebugger.?()
    [junit] INFO  - read CV: 81 mode: Paged will read 123 [main] jmri.progdebugger.ProgDebugger.?()
    [junit] INFO  - write CV: 81 to: 149 mode: Paged [main] jmri.progdebugger.ProgDebugger.?()
    [junit] INFO  - write CV: 81 to: 23 mode: Paged [main] jmri.progdebugger.ProgDebugger.?()
    [junit] INFO  - write CV: 81 to: 23 mode: Paged [main] jmri.progdebugger.ProgDebugger.?()
    [junit] INFO  - write CV: 17 to: 210 mode: Paged [main] jmri.progdebugger.ProgDebugger.?()
    [junit] INFO  - write CV: 18 to: 189 mode: Paged [main] jmri.progdebugger.ProgDebugger.?()
    [junit] INFO  - read CV: 17 mode: Paged will read 123 [main] jmri.progdebugger.ProgDebugger.?()
    [junit] INFO  - read CV: 18 mode: Paged will read 123 [main] jmri.progdebugger.ProgDebugger.?()
    [junit] INFO  - write CV: 12 to: 61 mode: Paged [main] jmri.progdebugger.ProgDebugger.?()
    [junit] INFO  - write CV: 18 to: 74 mode: Paged [main] jmri.progdebugger.ProgDebugger.?()
    [junit] INFO  - read CV: 12 mode: Paged will read 123 [main] jmri.progdebugger.ProgDebugger.?()
    [junit] INFO  - read CV: 18 mode: Paged will read 123 [main] jmri.progdebugger.ProgDebugger.?()
    [junit] INFO  - read CV: 91 mode: Paged will read 123 [main] jmri.progdebugger.ProgDebugger.?()
    [junit] INFO  - write CV: 91 to: 12 mode: Paged [main] jmri.progdebugger.ProgDebugger.?()
    [junit] INFO  - confirm CV: 66 mode: Paged will return -1 pass: false due to no previous value [main] jmri.progdebugger.ProgDebugger.?()
    [junit] INFO  - write CV: 67 to: 123 mode: Paged [main] jmri.progdebugger.ProgDebugger.?()
    [junit] INFO  - confirm CV: 67 mode: Paged will return 123 pass: true [main] jmri.progdebugger.ProgDebugger.?()
    [junit] INFO  - write CV: 3 to: 30 mode: Paged [main] jmri.progdebugger.ProgDebugger.?()
    [junit] INFO  - write CV: 2 to: 20 mode: Paged [main] jmri.progdebugger.ProgDebugger.?()
    [junit] INFO  - read CV: 3 mode: Paged will read 30 [main] jmri.progdebugger.ProgDebugger.?()
    [junit] INFO  - read CV: 2 mode: Paged will read 20 [main] jmri.progdebugger.ProgDebugger.?()
    [junit] INFO  - Using 19c98fcf-35a6-48b5-8363-e68a5643559d as the JMRI storage identity for profile id 3f2a8369 [main] jmri.util.node.NodeIdentity.?()
    [junit] INFO  - Using 19c98fcf-35a6-48b5-8363-e68a5643559d as the JMRI storage identity for profile id 3e1639b7 [main] jmri.util.node.NodeIdentity.?()
    [junit] INFO  - Using 19c98fcf-35a6-48b5-8363-e68a5643559d as the JMRI storage identity for profile id 3f66777f [main] jmri.util.node.NodeIdentity.?()
    [junit] INFO  - Using 19c98fcf-35a6-48b5-8363-e68a5643559d as the JMRI storage identity for profile id 3e6570ec [main] jmri.util.node.NodeIdentity.?()
    [junit] INFO  - Using 19c98fcf-35a6-48b5-8363-e68a5643559d as the JMRI storage identity for profile id 3c47e023 [main] jmri.util.node.NodeIdentity.?()
    [junit] INFO  - Did not find throttle preferences file.  This is normal if you haven't save the preferences before [main] jmri.jmrit.throttle.ThrottlesPreferences.?()
    [junit] INFO  - No power manager instance found, panel not active [main] jmri.jmrit.throttle.PowerManagerButton.?()
    [junit] INFO  - No power manager instance found, panel not active [main] jmri.jmrit.throttle.ThrottleWindow.?()
    [junit] INFO  - Using 19c98fcf-35a6-48b5-8363-e68a5643559d as the JMRI storage identity for profile id 3ee1766c [main] jmri.util.node.NodeIdentity.?()
    [junit] INFO  - Using 19c98fcf-35a6-48b5-8363-e68a5643559d as the JMRI storage identity for profile id 3da13b53 [main] jmri.util.node.NodeIdentity.?()
    [junit] INFO  - Using 19c98fcf-35a6-48b5-8363-e68a5643559d as the JMRI storage identity for profile id 3f7ca727 [main] jmri.util.node.NodeIdentity.?()
    [junit] INFO  - Using 19c98fcf-35a6-48b5-8363-e68a5643559d as the JMRI storage identity for profile id 3f6bb7e3 [main] jmri.util.node.NodeIdentity.?()
    [junit] INFO  - Using 19c98fcf-35a6-48b5-8363-e68a5643559d as the JMRI storage identity for profile id 3e52b1a0 [main] jmri.util.node.NodeIdentity.?()
    [junit] INFO  - Using 19c98fcf-35a6-48b5-8363-e68a5643559d as the JMRI storage identity for profile id 3f6461e2 [main] jmri.util.node.NodeIdentity.?()
    [junit] INFO  - Could not find WiThrottle preferences file (/var/lib/jenkins/jobs/Development/jobs/AllTest/workspace/temp/throttle/WiThrottlePreferences.xml).  Normal if preferences have not been saved before. [main] jmri.jmrit.withrottle.AbstractWiThrottlePreferences.?()
    [junit] INFO  - Could not find WiThrottle preferences file (/var/lib/jenkins/jobs/Development/jobs/AllTest/workspace/temp/throttle/WiThrottlePreferences.xml).  Normal if preferences have not been saved before. [main] jmri.jmrit.withrottle.AbstractWiThrottlePreferences.?()
    [junit] INFO  - Could not find WiThrottle preferences file (/var/lib/jenkins/jobs/Development/jobs/AllTest/workspace/temp/throttle/WiThrottlePreferences.xml).  Normal if preferences have not been saved before. [main] jmri.jmrit.withrottle.AbstractWiThrottlePreferences.?()
    [junit] INFO  - Could not find WiThrottle preferences file (/var/lib/jenkins/jobs/Development/jobs/AllTest/workspace/temp/throttle/WiThrottlePreferences.xml).  Normal if preferences have not been saved before. [main] jmri.jmrit.withrottle.AbstractWiThrottlePreferences.?()
    [junit] INFO  - Could not find WiThrottle preferences file (/var/lib/jenkins/jobs/Development/jobs/AllTest/workspace/temp/throttle/WiThrottlePreferences.xml).  Normal if preferences have not been saved before. [main] jmri.jmrit.withrottle.AbstractWiThrottlePreferences.?()
    [junit] INFO  - Could not find WiThrottle preferences file (/var/lib/jenkins/jobs/Development/jobs/AllTest/workspace/temp/throttle/WiThrottlePreferences.xml).  Normal if preferences have not been saved before. [main] jmri.jmrit.withrottle.AbstractWiThrottlePreferences.?()
    [junit] INFO  - Could not find WiThrottle preferences file (/var/lib/jenkins/jobs/Development/jobs/AllTest/workspace/temp/throttle/WiThrottlePreferences.xml).  Normal if preferences have not been saved before. [main] jmri.jmrit.withrottle.AbstractWiThrottlePreferences.?()
    [junit] INFO  - Could not find WiThrottle preferences file (/var/lib/jenkins/jobs/Development/jobs/AllTest/workspace/temp/throttle/WiThrottlePreferences.xml).  Normal if preferences have not been saved before. [main] jmri.jmrit.withrottle.AbstractWiThrottlePreferences.?()
    [junit] INFO  - Could not find WiThrottle preferences file (/var/lib/jenkins/jobs/Development/jobs/AllTest/workspace/temp/throttle/WiThrottlePreferences.xml).  Normal if preferences have not been saved before. [main] jmri.jmrit.withrottle.AbstractWiThrottlePreferences.?()
    [junit] INFO  - Could not find WiThrottle preferences file (/var/lib/jenkins/jobs/Development/jobs/AllTest/workspace/temp/throttle/WiThrottlePreferences.xml).  Normal if preferences have not been saved before. [main] jmri.jmrit.withrottle.AbstractWiThrottlePreferences.?()
    [junit] INFO  - Could not find WiThrottle preferences file (/var/lib/jenkins/jobs/Development/jobs/AllTest/workspace/temp/throttle/WiThrottlePreferences.xml).  Normal if preferences have not been saved before. [main] jmri.jmrit.withrottle.AbstractWiThrottlePreferences.?()
    [junit] INFO  - Could not find WiThrottle preferences file (/var/lib/jenkins/jobs/Development/jobs/AllTest/workspace/temp/throttle/WiThrottlePreferences.xml).  Normal if preferences have not been saved before. [main] jmri.jmrit.withrottle.AbstractWiThrottlePreferences.?()
    [junit] INFO  - Could not find WiThrottle preferences file (/var/lib/jenkins/jobs/Development/jobs/AllTest/workspace/temp/throttle/WiThrottlePreferences.xml).  Normal if preferences have not been saved before. [main] jmri.jmrit.withrottle.AbstractWiThrottlePreferences.?()
    [junit] INFO  - Could not find WiThrottle preferences file (/var/lib/jenkins/jobs/Development/jobs/AllTest/workspace/temp/throttle/WiThrottlePreferences.xml).  Normal if preferences have not been saved before. [main] jmri.jmrit.withrottle.AbstractWiThrottlePreferences.?()
    [junit] INFO  - Could not find WiThrottle preferences file (/var/lib/jenkins/jobs/Development/jobs/AllTest/workspace/temp/throttle/WiThrottlePreferences.xml).  Normal if preferences have not been saved before. [main] jmri.jmrit.withrottle.AbstractWiThrottlePreferences.?()
    [junit] INFO  - Could not find WiThrottle preferences file (/var/lib/jenkins/jobs/Development/jobs/AllTest/workspace/temp/throttle/WiThrottlePreferences.xml).  Normal if preferences have not been saved before. [main] jmri.jmrit.withrottle.AbstractWiThrottlePreferences.?()
    [junit] INFO  - Could not find WiThrottle preferences file (/var/lib/jenkins/jobs/Development/jobs/AllTest/workspace/temp/throttle/WiThrottlePreferences.xml).  Normal if preferences have not been saved before. [main] jmri.jmrit.withrottle.AbstractWiThrottlePreferences.?()
    [junit] INFO  - Could not find WiThrottle preferences file (/var/lib/jenkins/jobs/Development/jobs/AllTest/workspace/temp/throttle/WiThrottlePreferences.xml).  Normal if preferences have not been saved before. [main] jmri.jmrit.withrottle.AbstractWiThrottlePreferences.?()
    [junit] INFO  - Could not find WiThrottle preferences file (/var/lib/jenkins/jobs/Development/jobs/AllTest/workspace/temp/throttle/WiThrottlePreferences.xml).  Normal if preferences have not been saved before. [main] jmri.jmrit.withrottle.AbstractWiThrottlePreferences.?()
    [junit] INFO  - Could not find WiThrottle preferences file (/var/lib/jenkins/jobs/Development/jobs/AllTest/workspace/temp/throttle/WiThrottlePreferences.xml).  Normal if preferences have not been saved before. [main] jmri.jmrit.withrottle.AbstractWiThrottlePreferences.?()
    [junit] INFO  - Could not find WiThrottle preferences file (/var/lib/jenkins/jobs/Development/jobs/AllTest/workspace/temp/throttle/WiThrottlePreferences.xml).  Normal if preferences have not been saved before. [main] jmri.jmrit.withrottle.AbstractWiThrottlePreferences.?()
    [junit] INFO  - Could not find WiThrottle preferences file (/var/lib/jenkins/jobs/Development/jobs/AllTest/workspace/temp/throttle/WiThrottlePreferences.xml).  Normal if preferences have not been saved before. [main] jmri.jmrit.withrottle.AbstractWiThrottlePreferences.?()
    [junit] INFO  - Could not find WiThrottle preferences file (/var/lib/jenkins/jobs/Development/jobs/AllTest/workspace/temp/throttle/WiThrottlePreferences.xml).  Normal if preferences have not been saved before. [main] jmri.jmrit.withrottle.AbstractWiThrottlePreferences.?()
    [junit] INFO  - Could not find WiThrottle preferences file (/var/lib/jenkins/jobs/Development/jobs/AllTest/workspace/temp/throttle/WiThrottlePreferences.xml).  Normal if preferences have not been saved before. [main] jmri.jmrit.withrottle.AbstractWiThrottlePreferences.?()
    [junit] INFO  - Could not find WiThrottle preferences file (/var/lib/jenkins/jobs/Development/jobs/AllTest/workspace/temp/throttle/WiThrottlePreferences.xml).  Normal if preferences have not been saved before. [main] jmri.jmrit.withrottle.AbstractWiThrottlePreferences.?()
    [junit] INFO  - Could not find WiThrottle preferences file (/var/lib/jenkins/jobs/Development/jobs/AllTest/workspace/temp/throttle/WiThrottlePreferences.xml).  Normal if preferences have not been saved before. [main] jmri.jmrit.withrottle.AbstractWiThrottlePreferences.?()
    [junit] INFO  - Could not find WiThrottle preferences file (/var/lib/jenkins/jobs/Development/jobs/AllTest/workspace/temp/throttle/WiThrottlePreferences.xml).  Normal if preferences have not been saved before. [main] jmri.jmrit.withrottle.AbstractWiThrottlePreferences.?()
    [junit] INFO  - No power manager instance. [main] jmri.jmrit.withrottle.TrackPowerController.?()
    [junit] INFO  - Could not find WiThrottle preferences file (/var/lib/jenkins/jobs/Development/jobs/AllTest/workspace/temp/throttle/WiThrottlePreferences.xml).  Normal if preferences have not been saved before. [main] jmri.jmrit.withrottle.AbstractWiThrottlePreferences.?()
    [junit] INFO  - Could not find WiThrottle preferences file (/var/lib/jenkins/jobs/Development/jobs/AllTest/workspace/temp/throttle/WiThrottlePreferences.xml).  Normal if preferences have not been saved before. [main] jmri.jmrit.withrottle.AbstractWiThrottlePreferences.?()
    [junit] INFO  - Could not find WiThrottle preferences file (/var/lib/jenkins/jobs/Development/jobs/AllTest/workspace/temp/throttle/WiThrottlePreferences.xml).  Normal if preferences have not been saved before. [main] jmri.jmrit.withrottle.AbstractWiThrottlePreferences.?()
    [junit] INFO  - No power manager instance found, panel not active [main] jmri.jmrit.throttle.PowerManagerButton.?()
    [junit] INFO  - Did not find throttle preferences file.  This is normal if you haven't save the preferences before [main] jmri.jmrit.throttle.ThrottlesPreferences.?()
    [junit] INFO  - No power manager instance found, panel not active [main] jmri.jmrit.throttle.PowerManagerButton.?()
    [junit] INFO  - Did not find throttle preferences file.  This is normal if you haven't save the preferences before [main] jmri.jmrit.throttle.ThrottlesPreferences.?()
    [junit] INFO  - No power manager instance found, panel not active [main] jmri.jmrit.throttle.PowerManagerButton.?()
    [junit] INFO  - Did not find throttle preferences file.  This is normal if you haven't save the preferences before [main] jmri.jmrit.throttle.ThrottlesPreferences.?()
    [junit] INFO  - No power manager instance found, panel not active [main] jmri.jmrit.throttle.PowerManagerButton.?()
    [junit] INFO  - Did not find throttle preferences file.  This is normal if you haven't save the preferences before [main] jmri.jmrit.throttle.ThrottlesPreferences.?()
    [junit] INFO  - No power manager instance found, panel not active [main] jmri.jmrit.throttle.PowerManagerButton.?()
    [junit] INFO  - Did not find throttle preferences file.  This is normal if you haven't save the preferences before [main] jmri.jmrit.throttle.ThrottlesPreferences.?()
    [junit] INFO  - No power manager instance found, panel not active [main] jmri.jmrit.throttle.PowerManagerButton.?()
    [junit] INFO  - No power manager instance found, panel not active [main] jmri.jmrit.throttle.PowerManagerButton.?()
    [junit] INFO  - No power manager instance found, panel not active [main] jmri.jmrit.throttle.PowerManagerButton.?()
    [junit] INFO  - No power manager instance found, panel not active [main] jmri.jmrit.throttle.ThrottleWindow.?()
    [junit] INFO  - Did not find throttle preferences file.  This is normal if you haven't save the preferences before [main] jmri.jmrit.throttle.ThrottlesPreferences.?()
    [junit] INFO  - No power manager instance found, panel not active [main] jmri.jmrit.throttle.PowerManagerButton.?()
    [junit] INFO  - No /tmp/junit4682102151011503818/junit6915694622693019345/testThrotttle.xml file to backup [main] jmri.jmrit.XmlFile.?()
    [junit] INFO  - No power manager instance found, panel not active [main] jmri.jmrit.throttle.ThrottleWindow.?()
    [junit] INFO  - Did not find throttle preferences file.  This is normal if you haven't save the preferences before [main] jmri.jmrit.throttle.ThrottlesPreferences.?()
    [junit] INFO  - No power manager instance found, panel not active [main] jmri.jmrit.throttle.PowerManagerButton.?()
    [junit] INFO  - No power manager instance found, panel not active [main] jmri.jmrit.throttle.ThrottleWindow.?()
    [junit] INFO  - Did not find throttle preferences file.  This is normal if you haven't save the preferences before [main] jmri.jmrit.throttle.ThrottlesPreferences.?()
    [junit] INFO  - No power manager instance found, panel not active [main] jmri.jmrit.throttle.PowerManagerButton.?()
    [junit] INFO  - No power manager instance found, panel not active [main] jmri.jmrit.throttle.ThrottleWindow.?()
    [junit] INFO  - Did not find throttle preferences file.  This is normal if you haven't save the preferences before [main] jmri.jmrit.throttle.ThrottlesPreferences.?()
    [junit] INFO  - No power manager instance found, panel not active [main] jmri.jmrit.throttle.PowerManagerButton.?()
    [junit] INFO  - No power manager instance found, panel not active [main] jmri.jmrit.throttle.ThrottleWindow.?()
    [junit] INFO  - Did not find throttle preferences file.  This is normal if you haven't save the preferences before [main] jmri.jmrit.throttle.ThrottlesPreferences.?()
    [junit] INFO  - No power manager instance found, panel not active [main] jmri.jmrit.throttle.PowerManagerButton.?()
    [junit] INFO  - No power manager instance found, panel not active [main] jmri.jmrit.throttle.ThrottleWindow.?()
    [junit] INFO  - Did not find throttle preferences file.  This is normal if you haven't save the preferences before [main] jmri.jmrit.throttle.ThrottlesPreferences.?()
    [junit] INFO  - No power manager instance found, panel not active [main] jmri.jmrit.throttle.PowerManagerButton.?()
    [junit] INFO  - No power manager instance found, panel not active [main] jmri.jmrit.throttle.ThrottleWindow.?()
    [junit] INFO  - Did not find throttle preferences file.  This is normal if you haven't save the preferences before [main] jmri.jmrit.throttle.ThrottlesPreferences.?()
    [junit] INFO  - No power manager instance found, panel not active [main] jmri.jmrit.throttle.PowerManagerButton.?()
    [junit] INFO  - No power manager instance found, panel not active [main] jmri.jmrit.throttle.ThrottleWindow.?()
    [junit] INFO  - Did not find throttle preferences file.  This is normal if you haven't save the preferences before [main] jmri.jmrit.throttle.ThrottlesPreferences.?()
    [junit] INFO  - No power manager instance found, panel not active [main] jmri.jmrit.throttle.PowerManagerButton.?()
    [junit] INFO  - No power manager instance found, panel not active [main] jmri.jmrit.throttle.ThrottleWindow.?()
    [junit] INFO  - Did not find throttle preferences file.  This is normal if you haven't save the preferences before [main] jmri.jmrit.throttle.ThrottlesPreferences.?()
    [junit] INFO  - No power manager instance found, panel not active [main] jmri.jmrit.throttle.PowerManagerButton.?()
    [junit] INFO  - No power manager instance found, panel not active [main] jmri.jmrit.throttle.ThrottleWindow.?()
    [junit] INFO  - Did not find throttle preferences file.  This is normal if you haven't save the preferences before [main] jmri.jmrit.throttle.ThrottlesPreferences.?()
    [junit] INFO  - No power manager instance found, panel not active [main] jmri.jmrit.throttle.PowerManagerButton.?()
    [junit] INFO  - No power manager instance found, panel not active [main] jmri.jmrit.throttle.ThrottleWindow.?()
    [junit] INFO  - Did not find throttle preferences file.  This is normal if you haven't save the preferences before [main] jmri.jmrit.throttle.ThrottlesPreferences.?()
    [junit] INFO  - No power manager instance found, panel not active [main] jmri.jmrit.throttle.PowerManagerButton.?()
    [junit] INFO  - No power manager instance found, panel not active [main] jmri.jmrit.throttle.ThrottleWindow.?()
    [junit] INFO  - Did not find throttle preferences file.  This is normal if you haven't save the preferences before [main] jmri.jmrit.throttle.ThrottlesPreferences.?()
    [junit] INFO  - No power manager instance found, panel not active [main] jmri.jmrit.throttle.PowerManagerButton.?()
    [junit] INFO  - No power manager instance found, panel not active [main] jmri.jmrit.throttle.ThrottleWindow.?()
    [junit] INFO  - Did not find throttle preferences file.  This is normal if you haven't save the preferences before [main] jmri.jmrit.throttle.ThrottlesPreferences.?()
    [junit] INFO  - No power manager instance found, panel not active [main] jmri.jmrit.throttle.PowerManagerButton.?()
    [junit] INFO  - No power manager instance found, panel not active [main] jmri.jmrit.throttle.ThrottleWindow.?()
    [junit] INFO  - Did not find throttle preferences file.  This is normal if you haven't save the preferences before [main] jmri.jmrit.throttle.ThrottlesPreferences.?()
    [junit] INFO  - No power manager instance found, panel not active [main] jmri.jmrit.throttle.PowerManagerButton.?()
    [junit] INFO  - No power manager instance found, panel not active [main] jmri.jmrit.throttle.ThrottleWindow.?()
    [junit] INFO  - Did not find throttle preferences file.  This is normal if you haven't save the preferences before [main] jmri.jmrit.throttle.ThrottlesPreferences.?()
    [junit] INFO  - No power manager instance found, panel not active [main] jmri.jmrit.throttle.PowerManagerButton.?()
    [junit] INFO  - No power manager instance found, panel not active [main] jmri.jmrit.throttle.ThrottleWindow.?()
    [junit] INFO  - Did not find throttle preferences file.  This is normal if you haven't save the preferences before [main] jmri.jmrit.throttle.ThrottlesPreferences.?()
    [junit] INFO  - No power manager instance found, panel not active [main] jmri.jmrit.throttle.PowerManagerButton.?()
    [junit] INFO  - No power manager instance found, panel not active [main] jmri.jmrit.throttle.ThrottleWindow.?()
    [junit] INFO  - Did not find throttle preferences file.  This is normal if you haven't save the preferences before [main] jmri.jmrit.throttle.ThrottlesPreferences.?()
    [junit] INFO  - No power manager instance found, panel not active [main] jmri.jmrit.throttle.PowerManagerButton.?()
    [junit] INFO  - No power manager instance found, panel not active [main] jmri.jmrit.throttle.ThrottleWindow.?()
    [junit] INFO  - Did not find throttle preferences file.  This is normal if you haven't save the preferences before [main] jmri.jmrit.throttle.ThrottlesPreferences.?()
    [junit] INFO  - No power manager instance found, panel not active [main] jmri.jmrit.throttle.PowerManagerButton.?()
    [junit] INFO  - No power manager instance found, panel not active [main] jmri.jmrit.throttle.ThrottleWindow.?()
    [junit] INFO  - Did not find throttle preferences file.  This is normal if you haven't save the preferences before [main] jmri.jmrit.throttle.ThrottlesPreferences.?()
    [junit] INFO  - No power manager instance found, panel not active [main] jmri.jmrit.throttle.PowerManagerButton.?()
    [junit] INFO  - Did not find throttle preferences file.  This is normal if you haven't save the preferences before [main] jmri.jmrit.throttle.ThrottlesPreferences.?()
    [junit] INFO  - No power manager instance found, panel not active [main] jmri.jmrit.throttle.PowerManagerButton.?()
    [junit] INFO  - No power manager instance found, panel not active [main] jmri.jmrit.throttle.ThrottleWindow.?()
    [junit] INFO  - Did not find throttle preferences file.  This is normal if you haven't save the preferences before [main] jmri.jmrit.throttle.ThrottlesPreferences.?()
    [junit] INFO  - No power manager instance found, panel not active [main] jmri.jmrit.throttle.PowerManagerButton.?()
    [junit] INFO  - Did not find throttle preferences file.  This is normal if you haven't save the preferences before [main] jmri.jmrit.throttle.ThrottlesPreferences.?()
    [junit] INFO  - Did not find throttle preferences file.  This is normal if you haven't save the preferences before [main] jmri.jmrit.throttle.ThrottlesPreferences.?()
    [junit] INFO  - No power manager instance found, panel not active [main] jmri.jmrit.throttle.PowerManagerButton.?()
    [junit] INFO  - No power manager instance found, panel not active [main] jmri.jmrit.throttle.ThrottleWindow.?()
    [junit] INFO  - Did not find throttle preferences file.  This is normal if you haven't save the preferences before [main] jmri.jmrit.throttle.ThrottlesPreferences.?()
    [junit] INFO  - No power manager instance found, panel not active [main] jmri.jmrit.throttle.PowerManagerButton.?()
    [junit] INFO  - No power manager instance found, panel not active [main] jmri.jmrit.throttle.ThrottleWindow.?()
    [junit] INFO  - Did not find throttle preferences file.  This is normal if you haven't save the preferences before [main] jmri.jmrit.throttle.ThrottlesPreferences.?()
    [junit] INFO  - No power manager instance found, panel not active [main] jmri.jmrit.throttle.PowerManagerButton.?()
    [junit] INFO  - No power manager instance found, panel not active [main] jmri.jmrit.throttle.ThrottleWindow.?()
    [junit] INFO  - Did not find throttle preferences file.  This is normal if you haven't save the preferences before [main] jmri.jmrit.throttle.ThrottlesPreferences.?()
    [junit] INFO  - No power manager instance found, panel not active [main] jmri.jmrit.throttle.PowerManagerButton.?()
    [junit] INFO  - Created with "foo" [main] jmri.jmrit.sample.SampleFunctionalClass.?()
    [junit] INFO  - SchedGen Import, version: SchedGen v0.8 [main] jmri.jmrit.timetable.TimeTableImport.?()
    [junit] INFO  - Using 19c98fcf-35a6-48b5-8363-e68a5643559d as the JMRI storage identity for profile id 3ee5eaba [main] jmri.util.node.NodeIdentity.?()
    [junit] INFO  - Using 19c98fcf-35a6-48b5-8363-e68a5643559d as the JMRI storage identity for profile id 3e811c0b [main] jmri.util.node.NodeIdentity.?()
    [junit] INFO  - creating new DefaultCabSignalManager [main] jmri.jmrit.cabsignals.CabSignalPane.?()
    [junit] INFO  - creating new DefaultCabSignalManager [main] jmri.jmrit.cabsignals.CabSignalPane.?()
    [junit] INFO  - creating new DefaultCabSignalManager [main] jmri.jmrit.cabsignals.CabSignalPane.?()
    [junit] INFO  - creating new DefaultCabSignalManager [main] jmri.jmrit.cabsignals.CabSignalPane.?()
    [junit] INFO  - Using 19c98fcf-35a6-48b5-8363-e68a5643559d as the JMRI storage identity for profile id 3f519915 [main] jmri.util.node.NodeIdentity.?()
    [junit] INFO  - creating new DefaultCabSignalManager [main] jmri.jmrit.cabsignals.CabSignalTableModel.?()
    [junit] INFO  - Using 19c98fcf-35a6-48b5-8363-e68a5643559d as the JMRI storage identity for profile id 3f769acf [main] jmri.util.node.NodeIdentity.?()
    [junit] INFO  - Table preferences not found.
    [junit] This is expected on the first time the "null" profile is used on this computer. [main] jmri.swing.JmriJTablePersistenceManager.?()
    [junit] INFO  - Using 19c98fcf-35a6-48b5-8363-e68a5643559d as the JMRI storage identity for profile id 3de460f3 [main] jmri.util.node.NodeIdentity.?()
    [junit] INFO  - This INFO message was emitted to test the entire logging chain, please don't remove [main] jmri.util.JUnitAppenderTest.?()
    [junit] WARN  - Thread was holding monitor java.lang.Object@5040ed2f from jmri.util.ThreadingUtilTest.testToGuiWarn(ThreadingUtilTest.java:46) [main] jmri.util.ThreadingUtil.?()
    [junit] java.lang.Exception: traceback
    [junit] 	at jmri.util.ThreadingUtil.warnLocks(ThreadingUtil.java:315)
    [junit] 	at jmri.util.ThreadingUtil.runOnGUI(ThreadingUtil.java:112)
    [junit] 	at jmri.util.ThreadingUtilTest.testToGuiWarn(ThreadingUtilTest.java:46)
    [junit] INFO  - Using 19c98fcf-35a6-48b5-8363-e68a5643559d as the JMRI storage identity for profile id 3f788b0f [main] jmri.util.node.NodeIdentity.?()
    [junit] INFO  - Using 19c98fcf-35a6-48b5-8363-e68a5643559d as the JMRI storage identity for profile id 3b6124f9 [main] jmri.util.node.NodeIdentity.?()
    [junit] INFO  - Starting Web Server on port 12080 [main] jmri.web.server.WebServer.?()
    [junit] INFO  - Starting ZeroConfService _http._tcp.local for Web Server with properties {path=/, json=5.0} [main] jmri.web.server.WebServer.?()
    [junit] INFO  - Stopping Web Server [main] jmri.web.server.WebServer.?()
    [junit] INFO  - Unzip file UnzipFileClass.txt to /var/lib/jenkins/jobs/Development/jobs/AllTest/workspace/temp/UnzipFileClass/UnzipFileClass.txt [main] jmri.util.PhysicalLocation.?()
    [junit] INFO  - Starting Web Server on port 12080 [main] jmri.web.server.WebServer.?()
    [junit] INFO  - Starting ZeroConfService _http._tcp.local for Web Server with properties {path=/, json=5.0} [main] jmri.web.server.WebServer.?()
    [junit] INFO  - Stopping Web Server [main] jmri.web.server.WebServer.?()
    [junit] INFO  - No preferences exist. [main] jmri.jmris.AbstractServerPreferences.?()
    [junit] INFO  - Could not find Server preferences file.  Normal if preferences have not been saved before. [main] jmri.jmris.AbstractServerPreferences.?()
    [junit] INFO  - Migrating from old preferences in Hello World to new format in /var/lib/jenkins/jobs/Development/jobs/AllTest/workspace/temp/profile. [main] jmri.jmris.AbstractServerPreferences.?()
    [junit] INFO  - Max road name (ALTON) length 5 [main] operations.rollingstock.cars.CarRoads.?()
    [junit] INFO  - Max car type name (Caboose) length 7 [main] operations.rollingstock.cars.CarTypes.?()
    [junit] INFO  - Max track name (South End 1) at (South End Staging) length 11 [main] jmrit.operations.locations.LocationManager.?()
    [junit] INFO  - Max location name (South End Staging) length 17 [main] jmrit.operations.locations.LocationManager.?()
    [junit] INFO  - Max location and track name (South End Staging, South End 1) length 28 [main] jmrit.operations.locations.LocationManager.?()
    [junit] INFO  - Saving copy of operations files to: temp/operations/JUnitTest/autoBackups/2019_05_15_00 [main] jmrit.operations.setup.BackupBase.?()
    [junit] INFO  - Max road name (ALTON) length 5 [main] operations.rollingstock.cars.CarRoads.?()
    [junit] INFO  - Max car type name (Caboose) length 7 [main] operations.rollingstock.cars.CarTypes.?()
    [junit] INFO  - Max track name (South End 1) at (South End Staging) length 11 [main] jmrit.operations.locations.LocationManager.?()
    [junit] INFO  - Max location name (South End Staging) length 17 [main] jmrit.operations.locations.LocationManager.?()
    [junit] INFO  - Max location and track name (South End Staging, South End 1) length 28 [main] jmrit.operations.locations.LocationManager.?()
    [junit] INFO  - Saving copy of operations files to: temp/operations/JUnitTest/autoBackups/2019_05_15_00 [main] jmrit.operations.setup.BackupBase.?()
    [junit] INFO  - Max road name (ALTON) length 5 [main] operations.rollingstock.cars.CarRoads.?()
    [junit] INFO  - Max car type name (Caboose) length 7 [main] operations.rollingstock.cars.CarTypes.?()
    [junit] INFO  - Max track name (South End 1) at (South End Staging) length 11 [main] jmrit.operations.locations.LocationManager.?()
    [junit] INFO  - Max location name (South End Staging) length 17 [main] jmrit.operations.locations.LocationManager.?()
    [junit] INFO  - Max location and track name (South End Staging, South End 1) length 28 [main] jmrit.operations.locations.LocationManager.?()
    [junit] INFO  - Saving copy of operations files to: temp/operations/JUnitTest/autoBackups/2019_05_15_00 [main] jmrit.operations.setup.BackupBase.?()
    [junit] INFO  - Max road name (ALTON) length 5 [main] operations.rollingstock.cars.CarRoads.?()
    [junit] INFO  - Max car type name (Caboose) length 7 [main] operations.rollingstock.cars.CarTypes.?()
    [junit] INFO  - Max track name (South End 1) at (South End Staging) length 11 [main] jmrit.operations.locations.LocationManager.?()
    [junit] INFO  - Max location name (South End Staging) length 17 [main] jmrit.operations.locations.LocationManager.?()
    [junit] INFO  - Max location and track name (South End Staging, South End 1) length 28 [main] jmrit.operations.locations.LocationManager.?()
    [junit] INFO  - Saving copy of operations files to: temp/operations/JUnitTest/autoBackups/2019_05_15_00 [main] jmrit.operations.setup.BackupBase.?()
    [junit] INFO  - Max road name (ALTON) length 5 [main] operations.rollingstock.cars.CarRoads.?()
    [junit] INFO  - Max car type name (Caboose) length 7 [main] operations.rollingstock.cars.CarTypes.?()
    [junit] INFO  - Max track name (South End 1) at (South End Staging) length 11 [main] jmrit.operations.locations.LocationManager.?()
    [junit] INFO  - Max location name (South End Staging) length 17 [main] jmrit.operations.locations.LocationManager.?()
    [junit] INFO  - Max location and track name (South End Staging, South End 1) length 28 [main] jmrit.operations.locations.LocationManager.?()
    [junit] INFO  - Saving copy of operations files to: temp/operations/JUnitTest/autoBackups/2019_05_15_00 [main] jmrit.operations.setup.BackupBase.?()
    [junit] INFO  - Max road name (ALTON) length 5 [main] operations.rollingstock.cars.CarRoads.?()
    [junit] INFO  - Max car type name (Caboose) length 7 [main] operations.rollingstock.cars.CarTypes.?()
    [junit] INFO  - Max track name (South End 1) at (South End Staging) length 11 [main] jmrit.operations.locations.LocationManager.?()
    [junit] INFO  - Max location name (South End Staging) length 17 [main] jmrit.operations.locations.LocationManager.?()
    [junit] INFO  - Max location and track name (South End Staging, South End 1) length 28 [main] jmrit.operations.locations.LocationManager.?()
    [junit] INFO  - Saving copy of operations files to: temp/operations/JUnitTest/autoBackups/2019_05_15_00 [main] jmrit.operations.setup.BackupBase.?()
    [junit] INFO  - No preferences exist. [main] jmri.jmris.AbstractServerPreferences.?()
    [junit] INFO  - Could not find Server preferences file.  Normal if preferences have not been saved before. [main] jmri.jmris.AbstractServerPreferences.?()
    [junit] INFO  - Migrating from old preferences in Hello World to new format in /var/lib/jenkins/jobs/Development/jobs/AllTest/workspace/temp/profile. [main] jmri.jmris.AbstractServerPreferences.?()
    [junit] WARN  - testOnMessage(jmri.server.json.time.JsonTimeSocketServiceTest) : run  1 failed, RetryRule repeats [main] util.junit.rules.RetryRule.evaluate()
    [junit] WARN  - testOnMessage(jmri.server.json.time.JsonTimeSocketServiceTest) : run  2 failed, RetryRule repeats [main] util.junit.rules.RetryRule.evaluate()
    [junit] ERROR - testOnMessage(jmri.server.json.time.JsonTimeSocketServiceTest) : giving up after 2 failures [main] util.junit.rules.RetryRule.evaluate()
    [junit] INFO  - Using 19c98fcf-35a6-48b5-8363-e68a5643559d as the JMRI storage identity for profile id 12345678 [main] jmri.util.node.NodeIdentity.?()
    [junit] INFO  - Using 19c98fcf-35a6-48b5-8363-e68a5643559d as the JMRI storage identity for profile id 12345678 [main] jmri.util.node.NodeIdentity.?()
    [junit] INFO  - Using 19c98fcf-35a6-48b5-8363-e68a5643559d as the JMRI storage identity for profile id 12345678 [main] jmri.util.node.NodeIdentity.?()
    [junit] INFO  - Using 19c98fcf-35a6-48b5-8363-e68a5643559d as the JMRI storage identity for profile id 12345678 [main] jmri.util.node.NodeIdentity.?()
    [junit] INFO  - Using 19c98fcf-35a6-48b5-8363-e68a5643559d as the JMRI storage identity for profile id 12345678 [main] jmri.util.node.NodeIdentity.?()
    [junit] INFO  - Using 19c98fcf-35a6-48b5-8363-e68a5643559d as the JMRI storage identity for profile id 12345678 [main] jmri.util.node.NodeIdentity.?()
    [junit] INFO  - Using 19c98fcf-35a6-48b5-8363-e68a5643559d as the JMRI storage identity for profile id 12345678 [main] jmri.util.node.NodeIdentity.?()
    [junit] INFO  - Using 19c98fcf-35a6-48b5-8363-e68a5643559d as the JMRI storage identity for profile id 12345678 [main] jmri.util.node.NodeIdentity.?()
    [junit] INFO  - Using 19c98fcf-35a6-48b5-8363-e68a5643559d as the JMRI storage identity for profile id 12345678 [main] jmri.util.node.NodeIdentity.?()
    [junit] INFO  - Using 19c98fcf-35a6-48b5-8363-e68a5643559d as the JMRI storage identity for profile id 12345678 [main] jmri.util.node.NodeIdentity.?()
    [junit] INFO  - Using 19c98fcf-35a6-48b5-8363-e68a5643559d as the JMRI storage identity for profile id 12345678 [main] jmri.util.node.NodeIdentity.?()
    [junit] INFO  - Using 19c98fcf-35a6-48b5-8363-e68a5643559d as the JMRI storage identity for profile id 12345678 [main] jmri.util.node.NodeIdentity.?()
    [junit] INFO  - Using 19c98fcf-35a6-48b5-8363-e68a5643559d as the JMRI storage identity for profile id 12345678 [main] jmri.util.node.NodeIdentity.?()
    [junit] INFO  - Using 19c98fcf-35a6-48b5-8363-e68a5643559d as the JMRI storage identity for profile id 12345678 [main] jmri.util.node.NodeIdentity.?()
    [junit] INFO  - Using 19c98fcf-35a6-48b5-8363-e68a5643559d as the JMRI storage identity for profile id 12345678 [main] jmri.util.node.NodeIdentity.?()
    [junit] INFO  - Using 19c98fcf-35a6-48b5-8363-e68a5643559d as the JMRI storage identity for profile id 12345678 [main] jmri.util.node.NodeIdentity.?()
    [junit] INFO  - Using 19c98fcf-35a6-48b5-8363-e68a5643559d as the JMRI storage identity for profile id 12345678 [main] jmri.util.node.NodeIdentity.?()
    [junit] INFO  - Using 19c98fcf-35a6-48b5-8363-e68a5643559d as the JMRI storage identity for profile id 12345678 [main] jmri.util.node.NodeIdentity.?()
    [junit] INFO  - Using 19c98fcf-35a6-48b5-8363-e68a5643559d as the JMRI storage identity for profile id 12345678 [main] jmri.util.node.NodeIdentity.?()
    [junit] INFO  - Using 19c98fcf-35a6-48b5-8363-e68a5643559d as the JMRI storage identity for profile id 12345678 [main] jmri.util.node.NodeIdentity.?()
    [junit] INFO  - Using 19c98fcf-35a6-48b5-8363-e68a5643559d as the JMRI storage identity for profile id 12345678 [main] jmri.util.node.NodeIdentity.?()
    [junit] INFO  - ECMAScript ECMA - 262 Edition 5.1 is provided by Oracle Nashorn 1.8.0_181 [main] jmri.script.JmriScriptEngineManager.?()
    [junit] INFO  - python 2.7 is provided by jython 2.7.0 [main] jmri.script.JmriScriptEngineManager.?()
    [junit] INFO  - ECMAScript ECMA - 262 Edition 5.1 is provided by Oracle Nashorn 1.8.0_181 [main] jmri.script.JmriScriptEngineManager.?()
    [junit] INFO  - python 2.7 is provided by jython 2.7.0 [main] jmri.script.JmriScriptEngineManager.?()
    [junit] INFO  - Using 19c98fcf-35a6-48b5-8363-e68a5643559d as the JMRI storage identity for profile id 00000000 [main] jmri.util.node.NodeIdentity.?()
    [junit] INFO  - ****** JMRI log ******* [main] jmri.util.Log4JUtil.?()
    [junit] INFO  - DecoderPro version 4.15.6ish+jenkins+20190515T1019Z+Rab7f324 starts under Java 1.8.0_181 on Linux amd64 v4.4.0-112-generic at Wed May 15 11:58:33 BST 2019 [main] apps.AppsBase.?()
    [junit] INFO  - No pre-existing config file found, searched for '/var/lib/jenkins/jobs/Development/jobs/AllTest/workspace/temp/DecoderProConfig3.xml' [main] apps.AppsBase.?()
    [junit] INFO  - File path program: is /var/lib/jenkins/jobs/Development/jobs/AllTest/workspace/ [main] jmri.util.FileUtilSupport.?()
    [junit] INFO  - File path preference: is /var/lib/jenkins/jobs/Development/jobs/AllTest/workspace/temp/ [main] jmri.util.FileUtilSupport.?()
    [junit] INFO  - File path profile: is /var/lib/jenkins/jobs/Development/jobs/AllTest/workspace/temp/ [main] jmri.util.FileUtilSupport.?()
    [junit] INFO  - File path settings: is /var/lib/jenkins/jobs/Development/jobs/AllTest/workspace/temp/ [main] jmri.util.FileUtilSupport.?()
    [junit] INFO  - File path home: is /var/lib/jenkins/ [main] jmri.util.FileUtilSupport.?()
    [junit] INFO  - File path scripts: is /var/lib/jenkins/jobs/Development/jobs/AllTest/workspace/jython/ [main] jmri.util.FileUtilSupport.?()
    [junit] INFO  - No power manager instance found, panel not active [main] jmri.jmrit.throttle.PowerManagerButton.?()
    [junit] INFO  - No pre-existing config file found, searched for '/var/lib/jenkins/jobs/Development/jobs/AllTest/workspace/temp/DecoderProConfig3.xml' [main] apps.AppsBase.?()
    [junit] INFO  - File path program: is /var/lib/jenkins/jobs/Development/jobs/AllTest/workspace/ [main] jmri.util.FileUtilSupport.?()
    [junit] INFO  - File path preference: is /var/lib/jenkins/jobs/Development/jobs/AllTest/workspace/temp/ [main] jmri.util.FileUtilSupport.?()
    [junit] INFO  - File path profile: is /var/lib/jenkins/jobs/Development/jobs/AllTest/workspace/temp/ [main] jmri.util.FileUtilSupport.?()
    [junit] INFO  - File path settings: is /var/lib/jenkins/jobs/Development/jobs/AllTest/workspace/temp/ [main] jmri.util.FileUtilSupport.?()
    [junit] INFO  - File path home: is /var/lib/jenkins/ [main] jmri.util.FileUtilSupport.?()
    [junit] INFO  - File path scripts: is /var/lib/jenkins/jobs/Development/jobs/AllTest/workspace/jython/ [main] jmri.util.FileUtilSupport.?()
    [junit] INFO  - No pre-existing config file found, searched for '/var/lib/jenkins/jobs/Development/jobs/AllTest/workspace/temp/DecoderProConfig3.xml' [main] apps.AppsBase.?()
    [junit] INFO  - File path program: is /var/lib/jenkins/jobs/Development/jobs/AllTest/workspace/ [main] jmri.util.FileUtilSupport.?()
    [junit] INFO  - File path preference: is /var/lib/jenkins/jobs/Development/jobs/AllTest/workspace/temp/ [main] jmri.util.FileUtilSupport.?()
    [junit] INFO  - File path profile: is /var/lib/jenkins/jobs/Development/jobs/AllTest/workspace/temp/ [main] jmri.util.FileUtilSupport.?()
    [junit] INFO  - File path settings: is /var/lib/jenkins/jobs/Development/jobs/AllTest/workspace/temp/ [main] jmri.util.FileUtilSupport.?()
    [junit] INFO  - File path home: is /var/lib/jenkins/ [main] jmri.util.FileUtilSupport.?()
    [junit] INFO  - File path scripts: is /var/lib/jenkins/jobs/Development/jobs/AllTest/workspace/jython/ [main] jmri.util.FileUtilSupport.?()
    [junit] INFO  - Manually attempting to create two LocoNet trees for testing purposes [main] apps.gui3.paned.PanelProFrame.?()
    [junit] INFO  - Did not find throttle preferences file.  This is normal if you haven't save the preferences before [main] jmri.jmrit.throttle.ThrottlesPreferences.?()
    [junit] INFO  - Could not find WiThrottle preferences file (/var/lib/jenkins/jobs/Development/jobs/AllTest/workspace/temp/throttle/WiThrottlePreferences.xml).  Normal if preferences have not been saved before. [main] jmri.jmrit.withrottle.AbstractWiThrottlePreferences.?()
    [junit] INFO  - Did not find throttle preferences file.  This is normal if you haven't save the preferences before [main] jmri.jmrit.throttle.ThrottlesPreferences.?()
    [junit] INFO  - Could not find WiThrottle preferences file (/var/lib/jenkins/jobs/Development/jobs/AllTest/workspace/temp/throttle/WiThrottlePreferences.xml).  Normal if preferences have not been saved before. [main] jmri.jmrit.withrottle.AbstractWiThrottlePreferences.?()
    [junit] INFO  - Did not find throttle preferences file.  This is normal if you haven't save the preferences before [main] jmri.jmrit.throttle.ThrottlesPreferences.?()
    [junit] INFO  - Could not find WiThrottle preferences file (/var/lib/jenkins/jobs/Development/jobs/AllTest/workspace/temp/throttle/WiThrottlePreferences.xml).  Normal if preferences have not been saved before. [main] jmri.jmrit.withrottle.AbstractWiThrottlePreferences.?()
    [junit] INFO  - Did not find throttle preferences file.  This is normal if you haven't save the preferences before [main] jmri.jmrit.throttle.ThrottlesPreferences.?()
    [junit] INFO  - Could not find WiThrottle preferences file (/var/lib/jenkins/jobs/Development/jobs/AllTest/workspace/temp/throttle/WiThrottlePreferences.xml).  Normal if preferences have not been saved before. [main] jmri.jmrit.withrottle.AbstractWiThrottlePreferences.?()
    [junit] INFO  - Did not find throttle preferences file.  This is normal if you haven't save the preferences before [main] jmri.jmrit.throttle.ThrottlesPreferences.?()
    [junit] INFO  - Could not find WiThrottle preferences file (/var/lib/jenkins/jobs/Development/jobs/AllTest/workspace/temp/throttle/WiThrottlePreferences.xml).  Normal if preferences have not been saved before. [main] jmri.jmrit.withrottle.AbstractWiThrottlePreferences.?()
    [junit] INFO  - Did not find throttle preferences file.  This is normal if you haven't save the preferences before [main] jmri.jmrit.throttle.ThrottlesPreferences.?()
    [junit] INFO  - Could not find WiThrottle preferences file (/var/lib/jenkins/jobs/Development/jobs/AllTest/workspace/temp/throttle/WiThrottlePreferences.xml).  Normal if preferences have not been saved before. [main] jmri.jmrit.withrottle.AbstractWiThrottlePreferences.?()
    [junit] INFO  - No pre-existing config file found, searched for '/var/lib/jenkins/jobs/Development/jobs/AllTest/workspace/temp/DecoderProConfig3.xml' [main] apps.AppsBase.?()
    [junit] INFO  - File path program: is /var/lib/jenkins/jobs/Development/jobs/AllTest/workspace/ [main] jmri.util.FileUtilSupport.?()
    [junit] INFO  - File path preference: is /var/lib/jenkins/jobs/Development/jobs/AllTest/workspace/temp/ [main] jmri.util.FileUtilSupport.?()
    [junit] INFO  - File path profile: is /var/lib/jenkins/jobs/Development/jobs/AllTest/workspace/temp/ [main] jmri.util.FileUtilSupport.?()
    [junit] INFO  - File path settings: is /var/lib/jenkins/jobs/Development/jobs/AllTest/workspace/temp/ [main] jmri.util.FileUtilSupport.?()
    [junit] INFO  - File path home: is /var/lib/jenkins/ [main] jmri.util.FileUtilSupport.?()
    [junit] INFO  - File path scripts: is /var/lib/jenkins/jobs/Development/jobs/AllTest/workspace/jython/ [main] jmri.util.FileUtilSupport.?()
    [junit] INFO  - Created default profile "My JMRI Railroad" [Time-limited test] jmri.profile.ProfileManager.?()
    [junit] INFO  - Starting with profile My_JMRI_Railroad.3ec1e6e7 [Time-limited test] apps.Apps.?()
    [junit] INFO  - No saved preferences, will open preferences window.  Searched for /tmp/junit3164062444958762518/junit5845378619466006092/My_JMRI_Railroad.jmri/ProfileConfig.xml [Time-limited test] apps.Apps.?()
    [junit] INFO  - File path program: is /var/lib/jenkins/jobs/Development/jobs/AllTest/workspace/ [Time-limited test] jmri.util.FileUtilSupport.?()
    [junit] INFO  - File path preference: is /var/lib/jenkins/jobs/Development/jobs/AllTest/workspace/temp/ [Time-limited test] jmri.util.FileUtilSupport.?()
    [junit] INFO  - File path profile: is /tmp/junit3164062444958762518/junit5845378619466006092/My_JMRI_Railroad.jmri/ [Time-limited test] jmri.util.FileUtilSupport.?()
    [junit] INFO  - File path settings: is /tmp/junit3164062444958762518/junit5845378619466006092/ [Time-limited test] jmri.util.FileUtilSupport.?()
    [junit] INFO  - File path home: is /var/lib/jenkins/ [Time-limited test] jmri.util.FileUtilSupport.?()
    [junit] INFO  - File path scripts: is /var/lib/jenkins/jobs/Development/jobs/AllTest/workspace/jython/ [Time-limited test] jmri.util.FileUtilSupport.?()
    [junit] INFO  - Using 19c98fcf-35a6-48b5-8363-e68a5643559d as the JMRI storage identity for profile id 3ec1e6e7 [Time-limited test] jmri.util.node.NodeIdentity.?()
    [junit] INFO  - Did not find throttle preferences file.  This is normal if you haven't save the preferences before [Time-limited test] jmri.jmrit.throttle.ThrottlesPreferences.?()
    [junit] INFO  - Could not find WiThrottle preferences file (/var/lib/jenkins/jobs/Development/jobs/AllTest/workspace/temp/throttle/WiThrottlePreferences.xml).  Normal if preferences have not been saved before. [Time-limited test] jmri.jmrit.withrottle.AbstractWiThrottlePreferences.?()
    [junit] INFO  - Starting with profile Sprog_Simulator.3d40b3b8 [Time-limited test] apps.Apps.?()
    [junit] INFO  - Using 19c98fcf-35a6-48b5-8363-e68a5643559d as the JMRI storage identity for profile id 3d40b3b8 [Time-limited test] jmri.util.node.NodeIdentity.?()
    [junit] INFO  - No local configuration found. [Time-limited test] jmri.jmrix.ConnectionConfigManager.?()
    [junit] INFO  - Starting to connect for "SPROG Sim" [Time-limited test] jmri.jmrix.configurexml.AbstractSerialConnectionConfigXml.?()
    [junit] INFO  - SPROG Simulator Started [Time-limited test] jmrix.sprog.simulator.SimulatorAdapter.?()
    [junit] INFO  - Table preferences not found.
    [junit] This is expected on the first time the "Sprog Simulator" profile is used on this computer. [Time-limited test] jmri.swing.JmriJTablePersistenceManager.?()
    [junit] INFO  - File path program: is /var/lib/jenkins/jobs/Development/jobs/AllTest/workspace/ [Time-limited test] jmri.util.FileUtilSupport.?()
    [junit] INFO  - File path preference: is /tmp/junit1476285058232273461/junit6100928442974023850/Sprog_Simulator/ [Time-limited test] jmri.util.FileUtilSupport.?()
    [junit] INFO  - File path profile: is /tmp/junit1476285058232273461/junit6100928442974023850/Sprog_Simulator/ [Time-limited test] jmri.util.FileUtilSupport.?()
    [junit] INFO  - File path settings: is /tmp/junit1476285058232273461/junit6100928442974023850/ [Time-limited test] jmri.util.FileUtilSupport.?()
    [junit] INFO  - File path home: is /var/lib/jenkins/ [Time-limited test] jmri.util.FileUtilSupport.?()
    [junit] INFO  - File path scripts: is /var/lib/jenkins/jobs/Development/jobs/AllTest/workspace/jython/ [Time-limited test] jmri.util.FileUtilSupport.?()
    [junit] INFO  - Starting with profile tmcc.3f0b414a [Time-limited test] apps.Apps.?()
    [junit] INFO  - Using 19c98fcf-35a6-48b5-8363-e68a5643559d as the JMRI storage identity for profile id 3f0b414a [Time-limited test] jmri.util.node.NodeIdentity.?()
    [junit] INFO  - No local configuration found. [Time-limited test] jmri.jmrix.ConnectionConfigManager.?()
    [junit] INFO  - Starting to connect for "TMCC Simulator" [Time-limited test] jmri.jmrix.configurexml.AbstractSerialConnectionConfigXml.?()
    [junit] INFO  - TMCC Simulator Started [Time-limited test] jmrix.tmcc.simulator.SimulatorAdapter.?()
    [junit] INFO  - Table preferences not found.
    [junit] This is expected on the first time the "tmcc" profile is used on this computer. [Time-limited test] jmri.swing.JmriJTablePersistenceManager.?()
    [junit] INFO  - File path program: is /var/lib/jenkins/jobs/Development/jobs/AllTest/workspace/ [Time-limited test] jmri.util.FileUtilSupport.?()
    [junit] INFO  - File path preference: is /tmp/junit4699130229712492008/junit2394202407168811355/TMCC_Simulator/ [Time-limited test] jmri.util.FileUtilSupport.?()
    [junit] INFO  - File path profile: is /tmp/junit4699130229712492008/junit2394202407168811355/TMCC_Simulator/ [Time-limited test] jmri.util.FileUtilSupport.?()
    [junit] INFO  - File path settings: is /tmp/junit4699130229712492008/junit2394202407168811355/ [Time-limited test] jmri.util.FileUtilSupport.?()
    [junit] INFO  - File path home: is /var/lib/jenkins/ [Time-limited test] jmri.util.FileUtilSupport.?()
    [junit] INFO  - File path scripts: is /var/lib/jenkins/jobs/Development/jobs/AllTest/workspace/jython/ [Time-limited test] jmri.util.FileUtilSupport.?()
    [junit] INFO  - Starting with profile LocoNet_Simulator.3eac0cdc [Time-limited test] apps.Apps.?()
    [junit] INFO  - Using 19c98fcf-35a6-48b5-8363-e68a5643559d as the JMRI storage identity for profile id 3eac0cdc [Time-limited test] jmri.util.node.NodeIdentity.?()
    [junit] INFO  - No local configuration found. [Time-limited test] jmri.jmrix.ConnectionConfigManager.?()
    [junit] INFO  - lnPacketizer Started [Time-limited test] jmri.jmrix.loconet.LnPacketizer.?()
    [junit] INFO  - LocoNet Simulator Started [Time-limited test] jmrix.loconet.hexfile.LnHexFilePort.?()
    [junit] INFO  - Table preferences not found.
    [junit] This is expected on the first time the "LocoNet Simulator" profile is used on this computer. [Time-limited test] jmri.swing.JmriJTablePersistenceManager.?()
    [junit] INFO  - File path program: is /var/lib/jenkins/jobs/Development/jobs/AllTest/workspace/ [Time-limited test] jmri.util.FileUtilSupport.?()
    [junit] INFO  - File path preference: is /tmp/junit2486245487956480264/junit635887897280125417/LocoNet_Simulator/ [Time-limited test] jmri.util.FileUtilSupport.?()
    [junit] INFO  - File path profile: is /tmp/junit2486245487956480264/junit635887897280125417/LocoNet_Simulator/ [Time-limited test] jmri.util.FileUtilSupport.?()
    [junit] INFO  - File path settings: is /tmp/junit2486245487956480264/junit635887897280125417/ [Time-limited test] jmri.util.FileUtilSupport.?()
    [junit] INFO  - File path home: is /var/lib/jenkins/ [Time-limited test] jmri.util.FileUtilSupport.?()
    [junit] INFO  - File path scripts: is /var/lib/jenkins/jobs/Development/jobs/AllTest/workspace/jython/ [Time-limited test] jmri.util.FileUtilSupport.?()
    [junit] INFO  - Starting with profile EasyDcc_Simulator.3f033c2b [Time-limited test] apps.Apps.?()
    [junit] INFO  - Using 19c98fcf-35a6-48b5-8363-e68a5643559d as the JMRI storage identity for profile id 3f033c2b [Time-limited test] jmri.util.node.NodeIdentity.?()
    [junit] INFO  - No local configuration found. [Time-limited test] jmri.jmrix.ConnectionConfigManager.?()
    [junit] INFO  - Starting to connect for "EasyDCC Simulator" [Time-limited test] jmri.jmrix.configurexml.AbstractSerialConnectionConfigXml.?()
    [junit] INFO  - EasyDCC Simulator Started [Time-limited test] jmrix.easydcc.simulator.SimulatorAdapter.?()
    [junit] INFO  - Table preferences not found.
    [junit] This is expected on the first time the "EasyDCC Simulator" profile is used on this computer. [Time-limited test] jmri.swing.JmriJTablePersistenceManager.?()
    [junit] INFO  - File path program: is /var/lib/jenkins/jobs/Development/jobs/AllTest/workspace/ [Time-limited test] jmri.util.FileUtilSupport.?()
    [junit] INFO  - File path preference: is /tmp/junit8424190954071154422/junit1005428010142792399/EasyDcc_Simulator/ [Time-limited test] jmri.util.FileUtilSupport.?()
    [junit] INFO  - File path profile: is /tmp/junit8424190954071154422/junit1005428010142792399/EasyDcc_Simulator/ [Time-limited test] jmri.util.FileUtilSupport.?()
    [junit] INFO  - File path settings: is /tmp/junit8424190954071154422/junit1005428010142792399/ [Time-limited test] jmri.util.FileUtilSupport.?()
    [junit] INFO  - File path home: is /var/lib/jenkins/ [Time-limited test] jmri.util.FileUtilSupport.?()
    [junit] INFO  - File path scripts: is /var/lib/jenkins/jobs/Development/jobs/AllTest/workspace/jython/ [Time-limited test] jmri.util.FileUtilSupport.?()
    [junit] INFO  - Starting with profile Prevent_Init_Loop.3f01644a [Time-limited test] apps.Apps.?()
    [junit] INFO  - Using 19c98fcf-35a6-48b5-8363-e68a5643559d as the JMRI storage identity for profile id 3f01644a [Time-limited test] jmri.util.node.NodeIdentity.?()
    [junit] INFO  - No local configuration found. [Time-limited test] jmri.jmrix.ConnectionConfigManager.?()
    [junit] INFO  - lnPacketizer Started [Time-limited test] jmri.jmrix.loconet.LnPacketizer.?()
    [junit] INFO  - LocoNet Simulator Started [Time-limited test] jmrix.loconet.hexfile.LnHexFilePort.?()
    [junit] INFO  - Table preferences not found.
    [junit] This is expected on the first time the "Prevent Init Loop" profile is used on this computer. [Time-limited test] jmri.swing.JmriJTablePersistenceManager.?()
    [junit] INFO  - Running script /tmp/junit5785070516136196491/junit5216834791546188980/Prevent_Init_Loop/jython/FollowJumpingPanel.py [Time-limited test] apps.PerformScriptModel.?()
    [junit] INFO  - ECMAScript ECMA - 262 Edition 5.1 is provided by Oracle Nashorn 1.8.0_181 [Time-limited test] jmri.script.JmriScriptEngineManager.?()
    [junit] INFO  - python 2.7 is provided by jython 2.7.0 [Time-limited test] jmri.script.JmriScriptEngineManager.?()
    [junit] INFO  - Loading file /tmp/junit5785070516136196491/junit5216834791546188980/Prevent_Init_Loop/Panels/jumping panels.xml [Time-limited test] apps.PerformFileModel.?()
    [junit] INFO  - FJP We have at least one entry on the JmriJFrame FrameList [Time-limited test] jython.exec.script.FollowJumpingPanel.?()
    [junit] INFO  - FJP Index #0  Title = "LocoNet Simulator"   upper left corner = ( 0, 0 ) [Time-limited test] jython.exec.script.FollowJumpingPanel.?()
    [junit] INFO  - FJP Index #1  Title = "JMRI System console"   upper left corner = ( 0, 0 ) [Time-limited test] jython.exec.script.FollowJumpingPanel.?()
    [junit] INFO  - FJP Index #2  Title = "rotate text test"   upper left corner = ( 566, 379 ) [Time-limited test] jython.exec.script.FollowJumpingPanel.?()
    [junit] INFO  - FJP Index #3  Title = "A"   upper left corner = ( 364, 39 ) [Time-limited test] jython.exec.script.FollowJumpingPanel.?()
    [junit] INFO  - FJP Index #4  Title = "B"   upper left corner = ( 0, 0 ) [Time-limited test] jython.exec.script.FollowJumpingPanel.?()
    [junit] INFO  - File path program: is /var/lib/jenkins/jobs/Development/jobs/AllTest/workspace/ [Time-limited test] jmri.util.FileUtilSupport.?()
    [junit] INFO  - File path preference: is /tmp/junit5785070516136196491/junit5216834791546188980/Prevent_Init_Loop/ [Time-limited test] jmri.util.FileUtilSupport.?()
    [junit] INFO  - File path profile: is /tmp/junit5785070516136196491/junit5216834791546188980/Prevent_Init_Loop/ [Time-limited test] jmri.util.FileUtilSupport.?()
    [junit] INFO  - File path settings: is /tmp/junit5785070516136196491/junit5216834791546188980/ [Time-limited test] jmri.util.FileUtilSupport.?()
    [junit] INFO  - File path home: is /var/lib/jenkins/ [Time-limited test] jmri.util.FileUtilSupport.?()
    [junit] INFO  - File path scripts: is /tmp/junit5785070516136196491/junit5216834791546188980/Prevent_Init_Loop/jython/ [Time-limited test] jmri.util.FileUtilSupport.?()
    [junit] INFO  - FJP Index #0  Title = "LocoNet Simulator"   upper left corner = ( 0, 0 ) [Time-limited test] jython.exec.script.FollowJumpingPanel.?()
    [junit] INFO  - FJP Index #1  Title = "JMRI System console"   upper left corner = ( 0, 0 ) [Time-limited test] jython.exec.script.FollowJumpingPanel.?()
    [junit] INFO  - FJP Index #2  Title = "rotate text test"   upper left corner = ( 566, 379 ) [Time-limited test] jython.exec.script.FollowJumpingPanel.?()
    [junit] INFO  - FJP Index #3  Title = "A"   upper left corner = ( 364, 39 ) [Time-limited test] jython.exec.script.FollowJumpingPanel.?()
    [junit] INFO  - FJP Index #4  Title = "B"   upper left corner = ( 1012, 30 ) [Time-limited test] jython.exec.script.FollowJumpingPanel.?()
    [junit] INFO  - FJP Index #5  Title = "DispatcherPro"   upper left corner = ( 0, 0 ) [Time-limited test] jython.exec.script.FollowJumpingPanel.?()
    [junit] INFO  - Starting with profile tmcc.3f0b414a [Time-limited test] apps.Apps.?()
    [junit] INFO  - No connections configured. [Time-limited test] jmri.jmrix.ConnectionConfigManager.?()
    [junit] INFO  - Table preferences not found.
    [junit] This is expected on the first time the "tmcc" profile is used on this computer. [Time-limited test] jmri.swing.JmriJTablePersistenceManager.?()
    [junit] INFO  - File path program: is /var/lib/jenkins/jobs/Development/jobs/AllTest/workspace/ [Time-limited test] jmri.util.FileUtilSupport.?()
    [junit] INFO  - File path preference: is /tmp/junit7512269398284147389/junit3856040531477043648/TMCC_Simulator/ [Time-limited test] jmri.util.FileUtilSupport.?()
    [junit] INFO  - File path profile: is /tmp/junit7512269398284147389/junit3856040531477043648/TMCC_Simulator/ [Time-limited test] jmri.util.FileUtilSupport.?()
    [junit] INFO  - File path settings: is /tmp/junit7512269398284147389/junit3856040531477043648/ [Time-limited test] jmri.util.FileUtilSupport.?()
    [junit] INFO  - File path home: is /var/lib/jenkins/ [Time-limited test] jmri.util.FileUtilSupport.?()
    [junit] INFO  - File path scripts: is /var/lib/jenkins/jobs/Development/jobs/AllTest/workspace/jython/ [Time-limited test] jmri.util.FileUtilSupport.?()
    [junit] INFO  - Starting with profile LocoNet_Simulator.3eac0cdc [Time-limited test] apps.Apps.?()
    [junit] INFO  - No connections configured. [Time-limited test] jmri.jmrix.ConnectionConfigManager.?()
    [junit] INFO  - Table preferences not found.
    [junit] This is expected on the first time the "LocoNet Simulator" profile is used on this computer. [Time-limited test] jmri.swing.JmriJTablePersistenceManager.?()
    [junit] INFO  - File path program: is /var/lib/jenkins/jobs/Development/jobs/AllTest/workspace/ [Time-limited test] jmri.util.FileUtilSupport.?()
    [junit] INFO  - File path preference: is /tmp/junit451789417593293961/junit3477368532065183782/LocoNet_Simulator/ [Time-limited test] jmri.util.FileUtilSupport.?()
    [junit] INFO  - File path profile: is /tmp/junit451789417593293961/junit3477368532065183782/LocoNet_Simulator/ [Time-limited test] jmri.util.FileUtilSupport.?()
    [junit] INFO  - File path settings: is /tmp/junit451789417593293961/junit3477368532065183782/ [Time-limited test] jmri.util.FileUtilSupport.?()
    [junit] INFO  - File path home: is /var/lib/jenkins/ [Time-limited test] jmri.util.FileUtilSupport.?()
    [junit] INFO  - File path scripts: is /var/lib/jenkins/jobs/Development/jobs/AllTest/workspace/jython/ [Time-limited test] jmri.util.FileUtilSupport.?()
    [junit] INFO  - Starting with profile EasyDcc_Simulator.3f033c2b [Time-limited test] apps.Apps.?()
    [junit] INFO  - No connections configured. [Time-limited test] jmri.jmrix.ConnectionConfigManager.?()
    [junit] INFO  - Table preferences not found.
    [junit] This is expected on the first time the "EasyDCC Simulator" profile is used on this computer. [Time-limited test] jmri.swing.JmriJTablePersistenceManager.?()
    [junit] INFO  - File path program: is /var/lib/jenkins/jobs/Development/jobs/AllTest/workspace/ [Time-limited test] jmri.util.FileUtilSupport.?()
    [junit] INFO  - File path preference: is /tmp/junit6974021825237195466/junit7725424845605701450/EasyDcc_Simulator/ [Time-limited test] jmri.util.FileUtilSupport.?()
    [junit] INFO  - File path profile: is /tmp/junit6974021825237195466/junit7725424845605701450/EasyDcc_Simulator/ [Time-limited test] jmri.util.FileUtilSupport.?()
    [junit] INFO  - File path settings: is /tmp/junit6974021825237195466/junit7725424845605701450/ [Time-limited test] jmri.util.FileUtilSupport.?()
    [junit] INFO  - File path home: is /var/lib/jenkins/ [Time-limited test] jmri.util.FileUtilSupport.?()
    [junit] INFO  - File path scripts: is /var/lib/jenkins/jobs/Development/jobs/AllTest/workspace/jython/ [Time-limited test] jmri.util.FileUtilSupport.?()
    [junit] INFO  - Starting with profile Prevent_Init_Loop.3f01644a [Time-limited test] apps.Apps.?()
    [junit] INFO  - No connections configured. [Time-limited test] jmri.jmrix.ConnectionConfigManager.?()
    [junit] INFO  - Table preferences not found.
    [junit] This is expected on the first time the "Prevent Init Loop" profile is used on this computer. [Time-limited test] jmri.swing.JmriJTablePersistenceManager.?()
    [junit] INFO  - File path program: is /var/lib/jenkins/jobs/Development/jobs/AllTest/workspace/ [Time-limited test] jmri.util.FileUtilSupport.?()
    [junit] INFO  - File path preference: is /tmp/junit5249178685591253319/junit6545337931610902289/Prevent_Init_Loop/ [Time-limited test] jmri.util.FileUtilSupport.?()
    [junit] INFO  - File path profile: is /tmp/junit5249178685591253319/junit6545337931610902289/Prevent_Init_Loop/ [Time-limited test] jmri.util.FileUtilSupport.?()
    [junit] INFO  - File path settings: is /tmp/junit5249178685591253319/junit6545337931610902289/ [Time-limited test] jmri.util.FileUtilSupport.?()
    [junit] INFO  - File path home: is /var/lib/jenkins/ [Time-limited test] jmri.util.FileUtilSupport.?()
    [junit] INFO  - File path scripts: is /tmp/junit5249178685591253319/junit6545337931610902289/Prevent_Init_Loop/jython/ [Time-limited test] jmri.util.FileUtilSupport.?()
    [junit] INFO  - Starting with profile tmcc.3f0b414a [Time-limited test] apps.Apps.?()
    [junit] INFO  - No connections configured. [Time-limited test] jmri.jmrix.ConnectionConfigManager.?()
    [junit] INFO  - Table preferences not found.
    [junit] This is expected on the first time the "tmcc" profile is used on this computer. [Time-limited test] jmri.swing.JmriJTablePersistenceManager.?()
    [junit] INFO  - File path program: is /var/lib/jenkins/jobs/Development/jobs/AllTest/workspace/ [Time-limited test] jmri.util.FileUtilSupport.?()
    [junit] INFO  - File path preference: is /tmp/junit8657015203420959727/junit8857802726676163100/TMCC_Simulator/ [Time-limited test] jmri.util.FileUtilSupport.?()
    [junit] INFO  - File path profile: is /tmp/junit8657015203420959727/junit8857802726676163100/TMCC_Simulator/ [Time-limited test] jmri.util.FileUtilSupport.?()
    [junit] INFO  - File path settings: is /tmp/junit8657015203420959727/junit8857802726676163100/ [Time-limited test] jmri.util.FileUtilSupport.?()
    [junit] INFO  - File path home: is /var/lib/jenkins/ [Time-limited test] jmri.util.FileUtilSupport.?()
    [junit] INFO  - File path scripts: is /var/lib/jenkins/jobs/Development/jobs/AllTest/workspace/jython/ [Time-limited test] jmri.util.FileUtilSupport.?()
    [junit] INFO  - Starting with profile LocoNet_Simulator.3eac0cdc [Time-limited test] apps.Apps.?()
    [junit] INFO  - No connections configured. [Time-limited test] jmri.jmrix.ConnectionConfigManager.?()
    [junit] INFO  - Table preferences not found.
    [junit] This is expected on the first time the "LocoNet Simulator" profile is used on this computer. [Time-limited test] jmri.swing.JmriJTablePersistenceManager.?()
    [junit] INFO  - File path program: is /var/lib/jenkins/jobs/Development/jobs/AllTest/workspace/ [Time-limited test] jmri.util.FileUtilSupport.?()
    [junit] INFO  - File path preference: is /tmp/junit6152567500706019087/junit1092329187228427559/LocoNet_Simulator/ [Time-limited test] jmri.util.FileUtilSupport.?()
    [junit] INFO  - File path profile: is /tmp/junit6152567500706019087/junit1092329187228427559/LocoNet_Simulator/ [Time-limited test] jmri.util.FileUtilSupport.?()
    [junit] INFO  - File path settings: is /tmp/junit6152567500706019087/junit1092329187228427559/ [Time-limited test] jmri.util.FileUtilSupport.?()
    [junit] INFO  - File path home: is /var/lib/jenkins/ [Time-limited test] jmri.util.FileUtilSupport.?()
    [junit] INFO  - File path scripts: is /var/lib/jenkins/jobs/Development/jobs/AllTest/workspace/jython/ [Time-limited test] jmri.util.FileUtilSupport.?()
    [junit] INFO  - Starting with profile EasyDcc_Simulator.3f033c2b [Time-limited test] apps.Apps.?()
    [junit] INFO  - No connections configured. [Time-limited test] jmri.jmrix.ConnectionConfigManager.?()
    [junit] INFO  - Table preferences not found.
    [junit] This is expected on the first time the "EasyDCC Simulator" profile is used on this computer. [Time-limited test] jmri.swing.JmriJTablePersistenceManager.?()
    [junit] INFO  - File path program: is /var/lib/jenkins/jobs/Development/jobs/AllTest/workspace/ [Time-limited test] jmri.util.FileUtilSupport.?()
    [junit] INFO  - File path preference: is /tmp/junit1201802467590034430/junit2053512900727110878/EasyDcc_Simulator/ [Time-limited test] jmri.util.FileUtilSupport.?()
    [junit] INFO  - File path profile: is /tmp/junit1201802467590034430/junit2053512900727110878/EasyDcc_Simulator/ [Time-limited test] jmri.util.FileUtilSupport.?()
    [junit] INFO  - File path settings: is /tmp/junit1201802467590034430/junit2053512900727110878/ [Time-limited test] jmri.util.FileUtilSupport.?()
    [junit] INFO  - File path home: is /var/lib/jenkins/ [Time-limited test] jmri.util.FileUtilSupport.?()
    [junit] INFO  - File path scripts: is /var/lib/jenkins/jobs/Development/jobs/AllTest/workspace/jython/ [Time-limited test] jmri.util.FileUtilSupport.?()
    [junit] INFO  - No pre-existing config file found, searched for '/tmp/junit1201802467590034430/junit2053512900727110878/EasyDcc_Simulator/ProfileConfig.xml' [main] apps.AppsBase.?()
    [junit] INFO  - File path program: is /var/lib/jenkins/jobs/Development/jobs/AllTest/workspace/ [main] jmri.util.FileUtilSupport.?()
    [junit] INFO  - File path preference: is /tmp/junit1201802467590034430/junit2053512900727110878/EasyDcc_Simulator/ [main] jmri.util.FileUtilSupport.?()
    [junit] INFO  - File path profile: is /tmp/junit1201802467590034430/junit2053512900727110878/ [main] jmri.util.FileUtilSupport.?()
    [junit] INFO  - File path settings: is /tmp/junit1201802467590034430/junit2053512900727110878/ [main] jmri.util.FileUtilSupport.?()
    [junit] INFO  - File path home: is /var/lib/jenkins/ [main] jmri.util.FileUtilSupport.?()
    [junit] INFO  - File path scripts: is /var/lib/jenkins/jobs/Development/jobs/AllTest/workspace/jython/ [main] jmri.util.FileUtilSupport.?()
    [junit] 
    [junit] INFO  - jmri.jmrix.ieee802154.xbee.XBeeInterfaceScaffold$1@7172f6cfConnection interface closed. [Thread-2294] jmrix.ieee802154.xbee.XBeeInterfaceScaffold$2.close()
    [junit] INFO  - jmri.jmrix.ieee802154.xbee.XBeeInterfaceScaffold$1@24bec96eConnection interface closed. [Thread-2302] jmrix.ieee802154.xbee.XBeeInterfaceScaffold$2.close()
    [junit] INFO  - jmri.jmrix.ieee802154.xbee.XBeeInterfaceScaffold$1@658a5635Connection interface closed. [Thread-2304] jmrix.ieee802154.xbee.XBeeInterfaceScaffold$2.close()
    [junit] INFO  - jmri.jmrix.ieee802154.xbee.XBeeInterfaceScaffold$1@5c503bc2Connection interface closed. [Thread-2293] jmrix.ieee802154.xbee.XBeeInterfaceScaffold$2.close()
    [junit] INFO  - jmri.jmrix.ieee802154.xbee.XBeeInterfaceScaffold$1@3c15d956Connection interface closed. [Thread-2299] jmrix.ieee802154.xbee.XBeeInterfaceScaffold$2.close()
    [junit] INFO  - jmri.jmrix.ieee802154.xbee.XBeeInterfaceScaffold$1@3d3dfdcConnection interface closed. [Thread-2295] jmrix.ieee802154.xbee.XBeeInterfaceScaffold$2.close()
    [junit] INFO  - jmri.jmrix.ieee802154.xbee.XBeeInterfaceScaffold$1@b606714Connection interface closed. [Thread-2298] jmrix.ieee802154.xbee.XBeeInterfaceScaffold$2.close()
    [junit] INFO  - jmri.jmrix.ieee802154.xbee.XBeeInterfaceScaffold$1@20bac2caConnection interface closed. [Thread-2303] jmrix.ieee802154.xbee.XBeeInterfaceScaffold$2.close()
    [junit] INFO  - jmri.jmrix.ieee802154.xbee.XBeeInterfaceScaffold$1@4441c4f1Connection interface closed. [Thread-2282] jmrix.ieee802154.xbee.XBeeInterfaceScaffold$2.close()
    [junit] INFO  - jmri.jmrix.ieee802154.xbee.XBeeInterfaceScaffold$1@3dbe0eddConnection interface closed. [Thread-2300] jmrix.ieee802154.xbee.XBeeInterfaceScaffold$2.close()
    [junit] INFO  - jmri.jmrix.ieee802154.xbee.XBeeInterfaceScaffold$1@22cb5673Connection interface closed. [Thread-2301] jmrix.ieee802154.xbee.XBeeInterfaceScaffold$2.close()
    [junit] Test apps.tests.AllTest FAILED

BUILD SUCCESSFUL
Total time: 42 minutes 44 seconds
Xvfb stopping
Recording test results
Build step 'Publish JUnit test result report' changed build result to UNSTABLE
[BFA] Scanning build for known causes...
[BFA] No failure causes found
[BFA] Done. 0s
Finished: UNSTABLE