FailedConsole Output

Skipping 178 KB.. Full Log
java:73)
    [junit] 	at cucumber.api.junit.Cucumber.runChild(Cucumber.java:99)
    [junit] 	at cucumber.api.junit.Cucumber.runChild(Cucumber.java:41)
    [junit] 	at cucumber.api.junit.Cucumber$1.evaluate(Cucumber.java:108)
    [junit] 	at ✽.I am using firefox(java/acceptancetest/features/web/WebServer.feature:5)
    [junit] 
    [junit] 
    [junit] Testcase: Basic Http requests(JMRI Web Server):	Caused an ERROR
    [junit] unknown error: cannot find Chrome binary
    [junit] Build info: version: '3.6.0', revision: '6fbf3ec767', time: '2017-09-27T16:15:40.131Z'
    [junit] System info: host: 'xvm50620.vps.cloud.tagadab.com', ip: '31.172.250.170', os.name: 'Linux', os.arch: 'amd64', os.version: '4.4.0-112-generic', java.version: '1.8.0_181'
    [junit] Driver info: driver.version: unknown
    [junit] remote stacktrace: #0 0x55c1d4a86299 <unknown>
    [junit] 
    [junit] org.openqa.selenium.WebDriverException: unknown error: cannot find Chrome binary
    [junit] Build info: version: '3.6.0', revision: '6fbf3ec767', time: '2017-09-27T16:15:40.131Z'
    [junit] System info: host: 'xvm50620.vps.cloud.tagadab.com', ip: '31.172.250.170', os.name: 'Linux', os.arch: 'amd64', os.version: '4.4.0-112-generic', java.version: '1.8.0_181'
    [junit] Driver info: driver.version: unknown
    [junit] remote stacktrace: #0 0x55c1d4a86299 <unknown>
    [junit] 
    [junit] 	at ✽.I am using chrome(java/acceptancetest/features/web/WebServer.feature:5)
    [junit] 
    [junit] 
    [junit] Testcase: Basic Http requests(JMRI Web Server):	Caused an ERROR
    [junit] unknown error: cannot find Chrome binary
    [junit] Build info: version: '3.6.0', revision: '6fbf3ec767', time: '2017-09-27T16:15:40.131Z'
    [junit] System info: host: 'xvm50620.vps.cloud.tagadab.com', ip: '31.172.250.170', os.name: 'Linux', os.arch: 'amd64', os.version: '4.4.0-112-generic', java.version: '1.8.0_181'
    [junit] Driver info: driver.version: unknown
    [junit] remote stacktrace: #0 0x5632d411a299 <unknown>
    [junit] 
    [junit] org.openqa.selenium.WebDriverException: unknown error: cannot find Chrome binary
    [junit] Build info: version: '3.6.0', revision: '6fbf3ec767', time: '2017-09-27T16:15:40.131Z'
    [junit] System info: host: 'xvm50620.vps.cloud.tagadab.com', ip: '31.172.250.170', os.name: 'Linux', os.arch: 'amd64', os.version: '4.4.0-112-generic', java.version: '1.8.0_181'
    [junit] Driver info: driver.version: unknown
    [junit] remote stacktrace: #0 0x5632d411a299 <unknown>
    [junit] 
    [junit] 	at ✽.I am using chrome(java/acceptancetest/features/web/WebServer.feature:5)
    [junit] 
    [junit] 
    [junit] Testcase: Basic Http requests(JMRI Web Server):	Caused an ERROR
    [junit] unknown error: cannot find Chrome binary
    [junit] Build info: version: '3.6.0', revision: '6fbf3ec767', time: '2017-09-27T16:15:40.131Z'
    [junit] System info: host: 'xvm50620.vps.cloud.tagadab.com', ip: '31.172.250.170', os.name: 'Linux', os.arch: 'amd64', os.version: '4.4.0-112-generic', java.version: '1.8.0_181'
    [junit] Driver info: driver.version: unknown
    [junit] remote stacktrace: #0 0x563291750299 <unknown>
    [junit] 
    [junit] org.openqa.selenium.WebDriverException: unknown error: cannot find Chrome binary
    [junit] Build info: version: '3.6.0', revision: '6fbf3ec767', time: '2017-09-27T16:15:40.131Z'
    [junit] System info: host: 'xvm50620.vps.cloud.tagadab.com', ip: '31.172.250.170', os.name: 'Linux', os.arch: 'amd64', os.version: '4.4.0-112-generic', java.version: '1.8.0_181'
    [junit] Driver info: driver.version: unknown
    [junit] remote stacktrace: #0 0x563291750299 <unknown>
    [junit] 
    [junit] 	at ✽.I am using chrome(java/acceptancetest/features/web/WebServer.feature:5)
    [junit] 
    [junit] 
    [junit] Testcase: Basic Http requests(JMRI Web Server):	Caused an ERROR
    [junit] unknown error: cannot find Chrome binary
    [junit] Build info: version: '3.6.0', revision: '6fbf3ec767', time: '2017-09-27T16:15:40.131Z'
    [junit] System info: host: 'xvm50620.vps.cloud.tagadab.com', ip: '31.172.250.170', os.name: 'Linux', os.arch: 'amd64', os.version: '4.4.0-112-generic', java.version: '1.8.0_181'
    [junit] Driver info: driver.version: ChromeDriver
    [junit] remote stacktrace: #0 0x55f69e2fa299 <unknown>
    [junit] 
    [junit] org.openqa.selenium.WebDriverException: unknown error: cannot find Chrome binary
    [junit] Build info: version: '3.6.0', revision: '6fbf3ec767', time: '2017-09-27T16:15:40.131Z'
    [junit] System info: host: 'xvm50620.vps.cloud.tagadab.com', ip: '31.172.250.170', os.name: 'Linux', os.arch: 'amd64', os.version: '4.4.0-112-generic', java.version: '1.8.0_181'
    [junit] Driver info: driver.version: ChromeDriver
    [junit] remote stacktrace: #0 0x55f69e2fa299 <unknown>
    [junit] 
    [junit] 	at java.lang.reflect.Constructor.newInstance(Constructor.java:423)
    [junit] 	at org.openqa.selenium.remote.W3CHandshakeResponse.lambda$new$0(W3CHandshakeResponse.java:57)
    [junit] 	at org.openqa.selenium.remote.W3CHandshakeResponse.lambda$getResponseFunction$2(W3CHandshakeResponse.java:104)
    [junit] 	at org.openqa.selenium.remote.ProtocolHandshake.lambda$createSession$24(ProtocolHandshake.java:359)
    [junit] 	at java.util.stream.ReferencePipeline$3$1.accept(ReferencePipeline.java:193)
    [junit] 	at java.util.Spliterators$ArraySpliterator.tryAdvance(Spliterators.java:958)
    [junit] 	at java.util.stream.ReferencePipeline.forEachWithCancel(ReferencePipeline.java:126)
    [junit] 	at java.util.stream.AbstractPipeline.copyIntoWithCancel(AbstractPipeline.java:498)
    [junit] 	at java.util.stream.AbstractPipeline.copyInto(AbstractPipeline.java:485)
    [junit] 	at java.util.stream.AbstractPipeline.wrapAndCopyInto(AbstractPipeline.java:471)
    [junit] 	at java.util.stream.FindOps$FindOp.evaluateSequential(FindOps.java:152)
    [junit] 	at java.util.stream.AbstractPipeline.evaluate(AbstractPipeline.java:234)
    [junit] 	at java.util.stream.ReferencePipeline.findFirst(ReferencePipeline.java:464)
    [junit] 	at org.openqa.selenium.remote.ProtocolHandshake.createSession(ProtocolHandshake.java:362)
    [junit] 	at org.openqa.selenium.remote.ProtocolHandshake.createSession(ProtocolHandshake.java:136)
    [junit] 	at org.openqa.selenium.remote.HttpCommandExecutor.execute(HttpCommandExecutor.java:142)
    [junit] 	at org.openqa.selenium.remote.service.DriverCommandExecutor.execute(DriverCommandExecutor.java:83)
    [junit] 	at org.openqa.selenium.remote.RemoteWebDriver.execute(RemoteWebDriver.java:586)
    [junit] 	at org.openqa.selenium.remote.RemoteWebDriver.startSession(RemoteWebDriver.java:217)
    [junit] 	at org.openqa.selenium.remote.RemoteWebDriver.<init>(RemoteWebDriver.java:140)
    [junit] 	at org.openqa.selenium.chrome.ChromeDriver.<init>(ChromeDriver.java:181)
    [junit] 	at org.openqa.selenium.chrome.ChromeDriver.<init>(ChromeDriver.java:168)
    [junit] 	at org.openqa.selenium.chrome.ChromeDriver.<init>(ChromeDriver.java:157)
    [junit] 	at jmri.util.web.BrowserFactory.getBrowser(BrowserFactory.java:59)
    [junit] 	at jmri.web.WebServerAcceptanceSteps.lambda$new$1(WebServerAcceptanceSteps.java:39)
    [junit] 	at cucumber.runtime.Utils$1.call(Utils.java:40)
    [junit] 	at cucumber.runtime.Timeout.timeout(Timeout.java:16)
    [junit] 	at cucumber.runtime.Utils.invoke(Utils.java:34)
    [junit] 	at cucumber.runtime.java8.Java8StepDefinition.execute(Java8StepDefinition.java:106)
    [junit] 	at cucumber.runtime.StepDefinitionMatch.runStep(StepDefinitionMatch.java:40)
    [junit] 	at cucumber.api.TestStep.executeStep(TestStep.java:102)
    [junit] 	at cucumber.api.TestStep.run(TestStep.java:83)
    [junit] 	at cucumber.api.TestCase.run(TestCase.java:58)
    [junit] 	at cucumber.runner.Runner.runPickle(Runner.java:80)
    [junit] 	at cucumber.runtime.junit.PickleRunners$NoStepDescriptions.run(PickleRunners.java:140)
    [junit] 	at cucumber.runtime.junit.FeatureRunner.runChild(FeatureRunner.java:68)
    [junit] 	at cucumber.runtime.junit.FeatureRunner.runChild(FeatureRunner.java:23)
    [junit] 	at cucumber.runtime.junit.FeatureRunner.run(FeatureRunner.java:73)
    [junit] 	at cucumber.api.junit.Cucumber.runChild(Cucumber.java:99)
    [junit] 	at cucumber.api.junit.Cucumber.runChild(Cucumber.java:41)
    [junit] 	at cucumber.api.junit.Cucumber$1.evaluate(Cucumber.java:108)
    [junit] 	at ✽.I am using chrome(java/acceptancetest/features/web/WebServer.feature:5)
    [junit] 
    [junit] 
    [junit] Testcase: Basic Http requests(JMRI Web Server):	Caused an ERROR
    [junit] unknown error: cannot find Chrome binary
    [junit] Build info: version: '3.6.0', revision: '6fbf3ec767', time: '2017-09-27T16:15:40.131Z'
    [junit] System info: host: 'xvm50620.vps.cloud.tagadab.com', ip: '31.172.250.170', os.name: 'Linux', os.arch: 'amd64', os.version: '4.4.0-112-generic', java.version: '1.8.0_181'
    [junit] Driver info: driver.version: ChromeDriver
    [junit] remote stacktrace: #0 0x560ca6408299 <unknown>
    [junit] 
    [junit] org.openqa.selenium.WebDriverException: unknown error: cannot find Chrome binary
    [junit] Build info: version: '3.6.0', revision: '6fbf3ec767', time: '2017-09-27T16:15:40.131Z'
    [junit] System info: host: 'xvm50620.vps.cloud.tagadab.com', ip: '31.172.250.170', os.name: 'Linux', os.arch: 'amd64', os.version: '4.4.0-112-generic', java.version: '1.8.0_181'
    [junit] Driver info: driver.version: ChromeDriver
    [junit] remote stacktrace: #0 0x560ca6408299 <unknown>
    [junit] 
    [junit] 	at java.lang.reflect.Constructor.newInstance(Constructor.java:423)
    [junit] 	at org.openqa.selenium.remote.W3CHandshakeResponse.lambda$new$0(W3CHandshakeResponse.java:57)
    [junit] 	at org.openqa.selenium.remote.W3CHandshakeResponse.lambda$getResponseFunction$2(W3CHandshakeResponse.java:104)
    [junit] 	at org.openqa.selenium.remote.ProtocolHandshake.lambda$createSession$24(ProtocolHandshake.java:359)
    [junit] 	at java.util.stream.ReferencePipeline$3$1.accept(ReferencePipeline.java:193)
    [junit] 	at java.util.Spliterators$ArraySpliterator.tryAdvance(Spliterators.java:958)
    [junit] 	at java.util.stream.ReferencePipeline.forEachWithCancel(ReferencePipeline.java:126)
    [junit] 	at java.util.stream.AbstractPipeline.copyIntoWithCancel(AbstractPipeline.java:498)
    [junit] 	at java.util.stream.AbstractPipeline.copyInto(AbstractPipeline.java:485)
    [junit] 	at java.util.stream.AbstractPipeline.wrapAndCopyInto(AbstractPipeline.java:471)
    [junit] 	at java.util.stream.FindOps$FindOp.evaluateSequential(FindOps.java:152)
    [junit] 	at java.util.stream.AbstractPipeline.evaluate(AbstractPipeline.java:234)
    [junit] 	at java.util.stream.ReferencePipeline.findFirst(ReferencePipeline.java:464)
    [junit] 	at org.openqa.selenium.remote.ProtocolHandshake.createSession(ProtocolHandshake.java:362)
    [junit] 	at org.openqa.selenium.remote.ProtocolHandshake.createSession(ProtocolHandshake.java:136)
    [junit] 	at org.openqa.selenium.remote.HttpCommandExecutor.execute(HttpCommandExecutor.java:142)
    [junit] 	at org.openqa.selenium.remote.service.DriverCommandExecutor.execute(DriverCommandExecutor.java:83)
    [junit] 	at org.openqa.selenium.remote.RemoteWebDriver.execute(RemoteWebDriver.java:586)
    [junit] 	at org.openqa.selenium.remote.RemoteWebDriver.startSession(RemoteWebDriver.java:217)
    [junit] 	at org.openqa.selenium.remote.RemoteWebDriver.<init>(RemoteWebDriver.java:140)
    [junit] 	at org.openqa.selenium.chrome.ChromeDriver.<init>(ChromeDriver.java:181)
    [junit] 	at org.openqa.selenium.chrome.ChromeDriver.<init>(ChromeDriver.java:168)
    [junit] 	at org.openqa.selenium.chrome.ChromeDriver.<init>(ChromeDriver.java:157)
    [junit] 	at jmri.util.web.BrowserFactory.getBrowser(BrowserFactory.java:59)
    [junit] 	at jmri.web.WebServerAcceptanceSteps.lambda$new$1(WebServerAcceptanceSteps.java:39)
    [junit] 	at cucumber.runtime.Utils$1.call(Utils.java:40)
    [junit] 	at cucumber.runtime.Timeout.timeout(Timeout.java:16)
    [junit] 	at cucumber.runtime.Utils.invoke(Utils.java:34)
    [junit] 	at cucumber.runtime.java8.Java8StepDefinition.execute(Java8StepDefinition.java:106)
    [junit] 	at cucumber.runtime.StepDefinitionMatch.runStep(StepDefinitionMatch.java:40)
    [junit] 	at cucumber.api.TestStep.executeStep(TestStep.java:102)
    [junit] 	at cucumber.api.TestStep.run(TestStep.java:83)
    [junit] 	at cucumber.api.TestCase.run(TestCase.java:58)
    [junit] 	at cucumber.runner.Runner.runPickle(Runner.java:80)
    [junit] 	at cucumber.runtime.junit.PickleRunners$NoStepDescriptions.run(PickleRunners.java:140)
    [junit] 	at cucumber.runtime.junit.FeatureRunner.runChild(FeatureRunner.java:68)
    [junit] 	at cucumber.runtime.junit.FeatureRunner.runChild(FeatureRunner.java:23)
    [junit] 	at cucumber.runtime.junit.FeatureRunner.run(FeatureRunner.java:73)
    [junit] 	at cucumber.api.junit.Cucumber.runChild(Cucumber.java:99)
    [junit] 	at cucumber.api.junit.Cucumber.runChild(Cucumber.java:41)
    [junit] 	at cucumber.api.junit.Cucumber$1.evaluate(Cucumber.java:108)
    [junit] 	at ✽.I am using chrome(java/acceptancetest/features/web/WebServer.feature:5)
    [junit] 
    [junit] 
    [junit] Testcase: Basic Http requests(JMRI Web Server):	Caused an ERROR
    [junit] unknown error: cannot find Chrome binary
    [junit] Build info: version: '3.6.0', revision: '6fbf3ec767', time: '2017-09-27T16:15:40.131Z'
    [junit] System info: host: 'xvm50620.vps.cloud.tagadab.com', ip: '31.172.250.170', os.name: 'Linux', os.arch: 'amd64', os.version: '4.4.0-112-generic', java.version: '1.8.0_181'
    [junit] Driver info: driver.version: ChromeDriver
    [junit] remote stacktrace: #0 0x558b58e44299 <unknown>
    [junit] 
    [junit] org.openqa.selenium.WebDriverException: unknown error: cannot find Chrome binary
    [junit] Build info: version: '3.6.0', revision: '6fbf3ec767', time: '2017-09-27T16:15:40.131Z'
    [junit] System info: host: 'xvm50620.vps.cloud.tagadab.com', ip: '31.172.250.170', os.name: 'Linux', os.arch: 'amd64', os.version: '4.4.0-112-generic', java.version: '1.8.0_181'
    [junit] Driver info: driver.version: ChromeDriver
    [junit] remote stacktrace: #0 0x558b58e44299 <unknown>
    [junit] 
    [junit] 	at java.lang.reflect.Constructor.newInstance(Constructor.java:423)
    [junit] 	at org.openqa.selenium.remote.W3CHandshakeResponse.lambda$new$0(W3CHandshakeResponse.java:57)
    [junit] 	at org.openqa.selenium.remote.W3CHandshakeResponse.lambda$getResponseFunction$2(W3CHandshakeResponse.java:104)
    [junit] 	at org.openqa.selenium.remote.ProtocolHandshake.lambda$createSession$24(ProtocolHandshake.java:359)
    [junit] 	at java.util.stream.ReferencePipeline$3$1.accept(ReferencePipeline.java:193)
    [junit] 	at java.util.Spliterators$ArraySpliterator.tryAdvance(Spliterators.java:958)
    [junit] 	at java.util.stream.ReferencePipeline.forEachWithCancel(ReferencePipeline.java:126)
    [junit] 	at java.util.stream.AbstractPipeline.copyIntoWithCancel(AbstractPipeline.java:498)
    [junit] 	at java.util.stream.AbstractPipeline.copyInto(AbstractPipeline.java:485)
    [junit] 	at java.util.stream.AbstractPipeline.wrapAndCopyInto(AbstractPipeline.java:471)
    [junit] 	at java.util.stream.FindOps$FindOp.evaluateSequential(FindOps.java:152)
    [junit] 	at java.util.stream.AbstractPipeline.evaluate(AbstractPipeline.java:234)
    [junit] 	at java.util.stream.ReferencePipeline.findFirst(ReferencePipeline.java:464)
    [junit] 	at org.openqa.selenium.remote.ProtocolHandshake.createSession(ProtocolHandshake.java:362)
    [junit] 	at org.openqa.selenium.remote.ProtocolHandshake.createSession(ProtocolHandshake.java:136)
    [junit] 	at org.openqa.selenium.remote.HttpCommandExecutor.execute(HttpCommandExecutor.java:142)
    [junit] 	at org.openqa.selenium.remote.service.DriverCommandExecutor.execute(DriverCommandExecutor.java:83)
    [junit] 	at org.openqa.selenium.remote.RemoteWebDriver.execute(RemoteWebDriver.java:586)
    [junit] 	at org.openqa.selenium.remote.RemoteWebDriver.startSession(RemoteWebDriver.java:217)
    [junit] 	at org.openqa.selenium.remote.RemoteWebDriver.<init>(RemoteWebDriver.java:140)
    [junit] 	at org.openqa.selenium.chrome.ChromeDriver.<init>(ChromeDriver.java:181)
    [junit] 	at org.openqa.selenium.chrome.ChromeDriver.<init>(ChromeDriver.java:168)
    [junit] 	at org.openqa.selenium.chrome.ChromeDriver.<init>(ChromeDriver.java:157)
    [junit] 	at jmri.util.web.BrowserFactory.getBrowser(BrowserFactory.java:59)
    [junit] 	at jmri.web.WebServerAcceptanceSteps.lambda$new$1(WebServerAcceptanceSteps.java:39)
    [junit] 	at cucumber.runtime.Utils$1.call(Utils.java:40)
    [junit] 	at cucumber.runtime.Timeout.timeout(Timeout.java:16)
    [junit] 	at cucumber.runtime.Utils.invoke(Utils.java:34)
    [junit] 	at cucumber.runtime.java8.Java8StepDefinition.execute(Java8StepDefinition.java:106)
    [junit] 	at cucumber.runtime.StepDefinitionMatch.runStep(StepDefinitionMatch.java:40)
    [junit] 	at cucumber.api.TestStep.executeStep(TestStep.java:102)
    [junit] 	at cucumber.api.TestStep.run(TestStep.java:83)
    [junit] 	at cucumber.api.TestCase.run(TestCase.java:58)
    [junit] 	at cucumber.runner.Runner.runPickle(Runner.java:80)
    [junit] 	at cucumber.runtime.junit.PickleRunners$NoStepDescriptions.run(PickleRunners.java:140)
    [junit] 	at cucumber.runtime.junit.FeatureRunner.runChild(FeatureRunner.java:68)
    [junit] 	at cucumber.runtime.junit.FeatureRunner.runChild(FeatureRunner.java:23)
    [junit] 	at cucumber.runtime.junit.FeatureRunner.run(FeatureRunner.java:73)
    [junit] 	at cucumber.api.junit.Cucumber.runChild(Cucumber.java:99)
    [junit] 	at cucumber.api.junit.Cucumber.runChild(Cucumber.java:41)
    [junit] 	at cucumber.api.junit.Cucumber$1.evaluate(Cucumber.java:108)
    [junit] 	at ✽.I am using chrome(java/acceptancetest/features/web/WebServer.feature:5)
    [junit] 
    [junit] 
    [junit] Testcase: Basic Http requests(JMRI Web Server):	Caused an ERROR
    [junit] unknown error: cannot find Chrome binary
    [junit] Build info: version: '3.6.0', revision: '6fbf3ec767', time: '2017-09-27T16:15:40.131Z'
    [junit] System info: host: 'xvm50620.vps.cloud.tagadab.com', ip: '31.172.250.170', os.name: 'Linux', os.arch: 'amd64', os.version: '4.4.0-112-generic', java.version: '1.8.0_181'
    [junit] Driver info: driver.version: ChromeDriver
    [junit] remote stacktrace: #0 0x56000424d299 <unknown>
    [junit] 
    [junit] org.openqa.selenium.WebDriverException: unknown error: cannot find Chrome binary
    [junit] Build info: version: '3.6.0', revision: '6fbf3ec767', time: '2017-09-27T16:15:40.131Z'
    [junit] System info: host: 'xvm50620.vps.cloud.tagadab.com', ip: '31.172.250.170', os.name: 'Linux', os.arch: 'amd64', os.version: '4.4.0-112-generic', java.version: '1.8.0_181'
    [junit] Driver info: driver.version: ChromeDriver
    [junit] remote stacktrace: #0 0x56000424d299 <unknown>
    [junit] 
    [junit] 	at java.lang.reflect.Constructor.newInstance(Constructor.java:423)
    [junit] 	at org.openqa.selenium.remote.W3CHandshakeResponse.lambda$new$0(W3CHandshakeResponse.java:57)
    [junit] 	at org.openqa.selenium.remote.W3CHandshakeResponse.lambda$getResponseFunction$2(W3CHandshakeResponse.java:104)
    [junit] 	at org.openqa.selenium.remote.ProtocolHandshake.lambda$createSession$24(ProtocolHandshake.java:359)
    [junit] 	at java.util.stream.ReferencePipeline$3$1.accept(ReferencePipeline.java:193)
    [junit] 	at java.util.Spliterators$ArraySpliterator.tryAdvance(Spliterators.java:958)
    [junit] 	at java.util.stream.ReferencePipeline.forEachWithCancel(ReferencePipeline.java:126)
    [junit] 	at java.util.stream.AbstractPipeline.copyIntoWithCancel(AbstractPipeline.java:498)
    [junit] 	at java.util.stream.AbstractPipeline.copyInto(AbstractPipeline.java:485)
    [junit] 	at java.util.stream.AbstractPipeline.wrapAndCopyInto(AbstractPipeline.java:471)
    [junit] 	at java.util.stream.FindOps$FindOp.evaluateSequential(FindOps.java:152)
    [junit] 	at java.util.stream.AbstractPipeline.evaluate(AbstractPipeline.java:234)
    [junit] 	at java.util.stream.ReferencePipeline.findFirst(ReferencePipeline.java:464)
    [junit] 	at org.openqa.selenium.remote.ProtocolHandshake.createSession(ProtocolHandshake.java:362)
    [junit] 	at org.openqa.selenium.remote.ProtocolHandshake.createSession(ProtocolHandshake.java:136)
    [junit] 	at org.openqa.selenium.remote.HttpCommandExecutor.execute(HttpCommandExecutor.java:142)
    [junit] 	at org.openqa.selenium.remote.service.DriverCommandExecutor.execute(DriverCommandExecutor.java:83)
    [junit] 	at org.openqa.selenium.remote.RemoteWebDriver.execute(RemoteWebDriver.java:586)
    [junit] 	at org.openqa.selenium.remote.RemoteWebDriver.startSession(RemoteWebDriver.java:217)
    [junit] 	at org.openqa.selenium.remote.RemoteWebDriver.<init>(RemoteWebDriver.java:140)
    [junit] 	at org.openqa.selenium.chrome.ChromeDriver.<init>(ChromeDriver.java:181)
    [junit] 	at org.openqa.selenium.chrome.ChromeDriver.<init>(ChromeDriver.java:168)
    [junit] 	at org.openqa.selenium.chrome.ChromeDriver.<init>(ChromeDriver.java:157)
    [junit] 	at jmri.util.web.BrowserFactory.getBrowser(BrowserFactory.java:59)
    [junit] 	at jmri.web.WebServerAcceptanceSteps.lambda$new$1(WebServerAcceptanceSteps.java:39)
    [junit] 	at cucumber.runtime.Utils$1.call(Utils.java:40)
    [junit] 	at cucumber.runtime.Timeout.timeout(Timeout.java:16)
    [junit] 	at cucumber.runtime.Utils.invoke(Utils.java:34)
    [junit] 	at cucumber.runtime.java8.Java8StepDefinition.execute(Java8StepDefinition.java:106)
    [junit] 	at cucumber.runtime.StepDefinitionMatch.runStep(StepDefinitionMatch.java:40)
    [junit] 	at cucumber.api.TestStep.executeStep(TestStep.java:102)
    [junit] 	at cucumber.api.TestStep.run(TestStep.java:83)
    [junit] 	at cucumber.api.TestCase.run(TestCase.java:58)
    [junit] 	at cucumber.runner.Runner.runPickle(Runner.java:80)
    [junit] 	at cucumber.runtime.junit.PickleRunners$NoStepDescriptions.run(PickleRunners.java:140)
    [junit] 	at cucumber.runtime.junit.FeatureRunner.runChild(FeatureRunner.java:68)
    [junit] 	at cucumber.runtime.junit.FeatureRunner.runChild(FeatureRunner.java:23)
    [junit] 	at cucumber.runtime.junit.FeatureRunner.run(FeatureRunner.java:73)
    [junit] 	at cucumber.api.junit.Cucumber.runChild(Cucumber.java:99)
    [junit] 	at cucumber.api.junit.Cucumber.runChild(Cucumber.java:41)
    [junit] 	at cucumber.api.junit.Cucumber$1.evaluate(Cucumber.java:108)
    [junit] 	at ✽.I am using chrome(java/acceptancetest/features/web/WebServer.feature:5)
    [junit] 
    [junit] 
    [junit] Testcase: Basic Http requests(JMRI Web Server):	Caused an ERROR
    [junit] unknown error: cannot find Chrome binary
    [junit] Build info: version: '3.6.0', revision: '6fbf3ec767', time: '2017-09-27T16:15:40.131Z'
    [junit] System info: host: 'xvm50620.vps.cloud.tagadab.com', ip: '31.172.250.170', os.name: 'Linux', os.arch: 'amd64', os.version: '4.4.0-112-generic', java.version: '1.8.0_181'
    [junit] Driver info: driver.version: ChromeDriver
    [junit] remote stacktrace: #0 0x55ab4eee8299 <unknown>
    [junit] 
    [junit] org.openqa.selenium.WebDriverException: unknown error: cannot find Chrome binary
    [junit] Build info: version: '3.6.0', revision: '6fbf3ec767', time: '2017-09-27T16:15:40.131Z'
    [junit] System info: host: 'xvm50620.vps.cloud.tagadab.com', ip: '31.172.250.170', os.name: 'Linux', os.arch: 'amd64', os.version: '4.4.0-112-generic', java.version: '1.8.0_181'
    [junit] Driver info: driver.version: ChromeDriver
    [junit] remote stacktrace: #0 0x55ab4eee8299 <unknown>
    [junit] 
    [junit] 	at java.lang.reflect.Constructor.newInstance(Constructor.java:423)
    [junit] 	at org.openqa.selenium.remote.W3CHandshakeResponse.lambda$new$0(W3CHandshakeResponse.java:57)
    [junit] 	at org.openqa.selenium.remote.W3CHandshakeResponse.lambda$getResponseFunction$2(W3CHandshakeResponse.java:104)
    [junit] 	at org.openqa.selenium.remote.ProtocolHandshake.lambda$createSession$24(ProtocolHandshake.java:359)
    [junit] 	at java.util.stream.ReferencePipeline$3$1.accept(ReferencePipeline.java:193)
    [junit] 	at java.util.Spliterators$ArraySpliterator.tryAdvance(Spliterators.java:958)
    [junit] 	at java.util.stream.ReferencePipeline.forEachWithCancel(ReferencePipeline.java:126)
    [junit] 	at java.util.stream.AbstractPipeline.copyIntoWithCancel(AbstractPipeline.java:498)
    [junit] 	at java.util.stream.AbstractPipeline.copyInto(AbstractPipeline.java:485)
    [junit] 	at java.util.stream.AbstractPipeline.wrapAndCopyInto(AbstractPipeline.java:471)
    [junit] 	at java.util.stream.FindOps$FindOp.evaluateSequential(FindOps.java:152)
    [junit] 	at java.util.stream.AbstractPipeline.evaluate(AbstractPipeline.java:234)
    [junit] 	at java.util.stream.ReferencePipeline.findFirst(ReferencePipeline.java:464)
    [junit] 	at org.openqa.selenium.remote.ProtocolHandshake.createSession(ProtocolHandshake.java:362)
    [junit] 	at org.openqa.selenium.remote.ProtocolHandshake.createSession(ProtocolHandshake.java:136)
    [junit] 	at org.openqa.selenium.remote.HttpCommandExecutor.execute(HttpCommandExecutor.java:142)
    [junit] 	at org.openqa.selenium.remote.service.DriverCommandExecutor.execute(DriverCommandExecutor.java:83)
    [junit] 	at org.openqa.selenium.remote.RemoteWebDriver.execute(RemoteWebDriver.java:586)
    [junit] 	at org.openqa.selenium.remote.RemoteWebDriver.startSession(RemoteWebDriver.java:217)
    [junit] 	at org.openqa.selenium.remote.RemoteWebDriver.<init>(RemoteWebDriver.java:140)
    [junit] 	at org.openqa.selenium.chrome.ChromeDriver.<init>(ChromeDriver.java:181)
    [junit] 	at org.openqa.selenium.chrome.ChromeDriver.<init>(ChromeDriver.java:168)
    [junit] 	at org.openqa.selenium.chrome.ChromeDriver.<init>(ChromeDriver.java:157)
    [junit] 	at jmri.util.web.BrowserFactory.getBrowser(BrowserFactory.java:59)
    [junit] 	at jmri.web.WebServerAcceptanceSteps.lambda$new$1(WebServerAcceptanceSteps.java:39)
    [junit] 	at cucumber.runtime.Utils$1.call(Utils.java:40)
    [junit] 	at cucumber.runtime.Timeout.timeout(Timeout.java:16)
    [junit] 	at cucumber.runtime.Utils.invoke(Utils.java:34)
    [junit] 	at cucumber.runtime.java8.Java8StepDefinition.execute(Java8StepDefinition.java:106)
    [junit] 	at cucumber.runtime.StepDefinitionMatch.runStep(StepDefinitionMatch.java:40)
    [junit] 	at cucumber.api.TestStep.executeStep(TestStep.java:102)
    [junit] 	at cucumber.api.TestStep.run(TestStep.java:83)
    [junit] 	at cucumber.api.TestCase.run(TestCase.java:58)
    [junit] 	at cucumber.runner.Runner.runPickle(Runner.java:80)
    [junit] 	at cucumber.runtime.junit.PickleRunners$NoStepDescriptions.run(PickleRunners.java:140)
    [junit] 	at cucumber.runtime.junit.FeatureRunner.runChild(FeatureRunner.java:68)
    [junit] 	at cucumber.runtime.junit.FeatureRunner.runChild(FeatureRunner.java:23)
    [junit] 	at cucumber.runtime.junit.FeatureRunner.run(FeatureRunner.java:73)
    [junit] 	at cucumber.api.junit.Cucumber.runChild(Cucumber.java:99)
    [junit] 	at cucumber.api.junit.Cucumber.runChild(Cucumber.java:41)
    [junit] 	at cucumber.api.junit.Cucumber$1.evaluate(Cucumber.java:108)
    [junit] 	at ✽.I am using chrome(java/acceptancetest/features/web/WebServer.feature:5)
    [junit] 
    [junit] 
    [junit] Testcase: Basic Http requests(JMRI Web Server):	Caused an ERROR
    [junit] unknown error: cannot find Chrome binary
    [junit] Build info: version: '3.6.0', revision: '6fbf3ec767', time: '2017-09-27T16:15:40.131Z'
    [junit] System info: host: 'xvm50620.vps.cloud.tagadab.com', ip: '31.172.250.170', os.name: 'Linux', os.arch: 'amd64', os.version: '4.4.0-112-generic', java.version: '1.8.0_181'
    [junit] Driver info: driver.version: ChromeDriver
    [junit] remote stacktrace: #0 0x563a8f01a299 <unknown>
    [junit] 
    [junit] org.openqa.selenium.WebDriverException: unknown error: cannot find Chrome binary
    [junit] Build info: version: '3.6.0', revision: '6fbf3ec767', time: '2017-09-27T16:15:40.131Z'
    [junit] System info: host: 'xvm50620.vps.cloud.tagadab.com', ip: '31.172.250.170', os.name: 'Linux', os.arch: 'amd64', os.version: '4.4.0-112-generic', java.version: '1.8.0_181'
    [junit] Driver info: driver.version: ChromeDriver
    [junit] remote stacktrace: #0 0x563a8f01a299 <unknown>
    [junit] 
    [junit] 	at java.lang.reflect.Constructor.newInstance(Constructor.java:423)
    [junit] 	at org.openqa.selenium.remote.W3CHandshakeResponse.lambda$new$0(W3CHandshakeResponse.java:57)
    [junit] 	at org.openqa.selenium.remote.W3CHandshakeResponse.lambda$getResponseFunction$2(W3CHandshakeResponse.java:104)
    [junit] 	at org.openqa.selenium.remote.ProtocolHandshake.lambda$createSession$24(ProtocolHandshake.java:359)
    [junit] 	at java.util.stream.ReferencePipeline$3$1.accept(ReferencePipeline.java:193)
    [junit] 	at java.util.Spliterators$ArraySpliterator.tryAdvance(Spliterators.java:958)
    [junit] 	at java.util.stream.ReferencePipeline.forEachWithCancel(ReferencePipeline.java:126)
    [junit] 	at java.util.stream.AbstractPipeline.copyIntoWithCancel(AbstractPipeline.java:498)
    [junit] 	at java.util.stream.AbstractPipeline.copyInto(AbstractPipeline.java:485)
    [junit] 	at java.util.stream.AbstractPipeline.wrapAndCopyInto(AbstractPipeline.java:471)
    [junit] 	at java.util.stream.FindOps$FindOp.evaluateSequential(FindOps.java:152)
    [junit] 	at java.util.stream.AbstractPipeline.evaluate(AbstractPipeline.java:234)
    [junit] 	at java.util.stream.ReferencePipeline.findFirst(ReferencePipeline.java:464)
    [junit] 	at org.openqa.selenium.remote.ProtocolHandshake.createSession(ProtocolHandshake.java:362)
    [junit] 	at org.openqa.selenium.remote.ProtocolHandshake.createSession(ProtocolHandshake.java:136)
    [junit] 	at org.openqa.selenium.remote.HttpCommandExecutor.execute(HttpCommandExecutor.java:142)
    [junit] 	at org.openqa.selenium.remote.service.DriverCommandExecutor.execute(DriverCommandExecutor.java:83)
    [junit] 	at org.openqa.selenium.remote.RemoteWebDriver.execute(RemoteWebDriver.java:586)
    [junit] 	at org.openqa.selenium.remote.RemoteWebDriver.startSession(RemoteWebDriver.java:217)
    [junit] 	at org.openqa.selenium.remote.RemoteWebDriver.<init>(RemoteWebDriver.java:140)
    [junit] 	at org.openqa.selenium.chrome.ChromeDriver.<init>(ChromeDriver.java:181)
    [junit] 	at org.openqa.selenium.chrome.ChromeDriver.<init>(ChromeDriver.java:168)
    [junit] 	at org.openqa.selenium.chrome.ChromeDriver.<init>(ChromeDriver.java:157)
    [junit] 	at jmri.util.web.BrowserFactory.getBrowser(BrowserFactory.java:59)
    [junit] 	at jmri.web.WebServerAcceptanceSteps.lambda$new$1(WebServerAcceptanceSteps.java:39)
    [junit] 	at cucumber.runtime.Utils$1.call(Utils.java:40)
    [junit] 	at cucumber.runtime.Timeout.timeout(Timeout.java:16)
    [junit] 	at cucumber.runtime.Utils.invoke(Utils.java:34)
    [junit] 	at cucumber.runtime.java8.Java8StepDefinition.execute(Java8StepDefinition.java:106)
    [junit] 	at cucumber.runtime.StepDefinitionMatch.runStep(StepDefinitionMatch.java:40)
    [junit] 	at cucumber.api.TestStep.executeStep(TestStep.java:102)
    [junit] 	at cucumber.api.TestStep.run(TestStep.java:83)
    [junit] 	at cucumber.api.TestCase.run(TestCase.java:58)
    [junit] 	at cucumber.runner.Runner.runPickle(Runner.java:80)
    [junit] 	at cucumber.runtime.junit.PickleRunners$NoStepDescriptions.run(PickleRunners.java:140)
    [junit] 	at cucumber.runtime.junit.FeatureRunner.runChild(FeatureRunner.java:68)
    [junit] 	at cucumber.runtime.junit.FeatureRunner.runChild(FeatureRunner.java:23)
    [junit] 	at cucumber.runtime.junit.FeatureRunner.run(FeatureRunner.java:73)
    [junit] 	at cucumber.api.junit.Cucumber.runChild(Cucumber.java:99)
    [junit] 	at cucumber.api.junit.Cucumber.runChild(Cucumber.java:41)
    [junit] 	at cucumber.api.junit.Cucumber$1.evaluate(Cucumber.java:108)
    [junit] 	at ✽.I am using chrome(java/acceptancetest/features/web/WebServer.feature:5)
    [junit] 
    [junit] 
    [junit] Testcase: Basic Http requests(JMRI Web Server):	Caused an ERROR
    [junit] unknown error: cannot find Chrome binary
    [junit] Build info: version: '3.6.0', revision: '6fbf3ec767', time: '2017-09-27T16:15:40.131Z'
    [junit] System info: host: 'xvm50620.vps.cloud.tagadab.com', ip: '31.172.250.170', os.name: 'Linux', os.arch: 'amd64', os.version: '4.4.0-112-generic', java.version: '1.8.0_181'
    [junit] Driver info: driver.version: ChromeDriver
    [junit] remote stacktrace: #0 0x55a7e2a8a299 <unknown>
    [junit] 
    [junit] org.openqa.selenium.WebDriverException: unknown error: cannot find Chrome binary
    [junit] Build info: version: '3.6.0', revision: '6fbf3ec767', time: '2017-09-27T16:15:40.131Z'
    [junit] System info: host: 'xvm50620.vps.cloud.tagadab.com', ip: '31.172.250.170', os.name: 'Linux', os.arch: 'amd64', os.version: '4.4.0-112-generic', java.version: '1.8.0_181'
    [junit] Driver info: driver.version: ChromeDriver
    [junit] remote stacktrace: #0 0x55a7e2a8a299 <unknown>
    [junit] 
    [junit] 	at java.lang.reflect.Constructor.newInstance(Constructor.java:423)
    [junit] 	at org.openqa.selenium.remote.W3CHandshakeResponse.lambda$new$0(W3CHandshakeResponse.java:57)
    [junit] 	at org.openqa.selenium.remote.W3CHandshakeResponse.lambda$getResponseFunction$2(W3CHandshakeResponse.java:104)
    [junit] 	at org.openqa.selenium.remote.ProtocolHandshake.lambda$createSession$24(ProtocolHandshake.java:359)
    [junit] 	at java.util.stream.ReferencePipeline$3$1.accept(ReferencePipeline.java:193)
    [junit] 	at java.util.Spliterators$ArraySpliterator.tryAdvance(Spliterators.java:958)
    [junit] 	at java.util.stream.ReferencePipeline.forEachWithCancel(ReferencePipeline.java:126)
    [junit] 	at java.util.stream.AbstractPipeline.copyIntoWithCancel(AbstractPipeline.java:498)
    [junit] 	at java.util.stream.AbstractPipeline.copyInto(AbstractPipeline.java:485)
    [junit] 	at java.util.stream.AbstractPipeline.wrapAndCopyInto(AbstractPipeline.java:471)
    [junit] 	at java.util.stream.FindOps$FindOp.evaluateSequential(FindOps.java:152)
    [junit] 	at java.util.stream.AbstractPipeline.evaluate(AbstractPipeline.java:234)
    [junit] 	at java.util.stream.ReferencePipeline.findFirst(ReferencePipeline.java:464)
    [junit] 	at org.openqa.selenium.remote.ProtocolHandshake.createSession(ProtocolHandshake.java:362)
    [junit] 	at org.openqa.selenium.remote.ProtocolHandshake.createSession(ProtocolHandshake.java:136)
    [junit] 	at org.openqa.selenium.remote.HttpCommandExecutor.execute(HttpCommandExecutor.java:142)
    [junit] 	at org.openqa.selenium.remote.service.DriverCommandExecutor.execute(DriverCommandExecutor.java:83)
    [junit] 	at org.openqa.selenium.remote.RemoteWebDriver.execute(RemoteWebDriver.java:586)
    [junit] 	at org.openqa.selenium.remote.RemoteWebDriver.startSession(RemoteWebDriver.java:217)
    [junit] 	at org.openqa.selenium.remote.RemoteWebDriver.<init>(RemoteWebDriver.java:140)
    [junit] 	at org.openqa.selenium.chrome.ChromeDriver.<init>(ChromeDriver.java:181)
    [junit] 	at org.openqa.selenium.chrome.ChromeDriver.<init>(ChromeDriver.java:168)
    [junit] 	at org.openqa.selenium.chrome.ChromeDriver.<init>(ChromeDriver.java:157)
    [junit] 	at jmri.util.web.BrowserFactory.getBrowser(BrowserFactory.java:59)
    [junit] 	at jmri.web.WebServerAcceptanceSteps.lambda$new$1(WebServerAcceptanceSteps.java:39)
    [junit] 	at cucumber.runtime.Utils$1.call(Utils.java:40)
    [junit] 	at cucumber.runtime.Timeout.timeout(Timeout.java:16)
    [junit] 	at cucumber.runtime.Utils.invoke(Utils.java:34)
    [junit] 	at cucumber.runtime.java8.Java8StepDefinition.execute(Java8StepDefinition.java:106)
    [junit] 	at cucumber.runtime.StepDefinitionMatch.runStep(StepDefinitionMatch.java:40)
    [junit] 	at cucumber.api.TestStep.executeStep(TestStep.java:102)
    [junit] 	at cucumber.api.TestStep.run(TestStep.java:83)
    [junit] 	at cucumber.api.TestCase.run(TestCase.java:58)
    [junit] 	at cucumber.runner.Runner.runPickle(Runner.java:80)
    [junit] 	at cucumber.runtime.junit.PickleRunners$NoStepDescriptions.run(PickleRunners.java:140)
    [junit] 	at cucumber.runtime.junit.FeatureRunner.runChild(FeatureRunner.java:68)
    [junit] 	at cucumber.runtime.junit.FeatureRunner.runChild(FeatureRunner.java:23)
    [junit] 	at cucumber.runtime.junit.FeatureRunner.run(FeatureRunner.java:73)
    [junit] 	at cucumber.api.junit.Cucumber.runChild(Cucumber.java:99)
    [junit] 	at cucumber.api.junit.Cucumber.runChild(Cucumber.java:41)
    [junit] 	at cucumber.api.junit.Cucumber$1.evaluate(Cucumber.java:108)
    [junit] 	at ✽.I am using chrome(java/acceptancetest/features/web/WebServer.feature:5)
    [junit] 
    [junit] 
    [junit] Testcase: Basic Http requests(JMRI Web Server):	Caused an ERROR
    [junit] unknown error: cannot find Chrome binary
    [junit] Build info: version: '3.6.0', revision: '6fbf3ec767', time: '2017-09-27T16:15:40.131Z'
    [junit] System info: host: 'xvm50620.vps.cloud.tagadab.com', ip: '31.172.250.170', os.name: 'Linux', os.arch: 'amd64', os.version: '4.4.0-112-generic', java.version: '1.8.0_181'
    [junit] Driver info: driver.version: ChromeDriver
    [junit] remote stacktrace: #0 0x55ee89a95299 <unknown>
    [junit] 
    [junit] org.openqa.selenium.WebDriverException: unknown error: cannot find Chrome binary
    [junit] Build info: version: '3.6.0', revision: '6fbf3ec767', time: '2017-09-27T16:15:40.131Z'
    [junit] System info: host: 'xvm50620.vps.cloud.tagadab.com', ip: '31.172.250.170', os.name: 'Linux', os.arch: 'amd64', os.version: '4.4.0-112-generic', java.version: '1.8.0_181'
    [junit] Driver info: driver.version: ChromeDriver
    [junit] remote stacktrace: #0 0x55ee89a95299 <unknown>
    [junit] 
    [junit] 	at java.lang.reflect.Constructor.newInstance(Constructor.java:423)
    [junit] 	at org.openqa.selenium.remote.W3CHandshakeResponse.lambda$new$0(W3CHandshakeResponse.java:57)
    [junit] 	at org.openqa.selenium.remote.W3CHandshakeResponse.lambda$getResponseFunction$2(W3CHandshakeResponse.java:104)
    [junit] 	at org.openqa.selenium.remote.ProtocolHandshake.lambda$createSession$24(ProtocolHandshake.java:359)
    [junit] 	at java.util.stream.ReferencePipeline$3$1.accept(ReferencePipeline.java:193)
    [junit] 	at java.util.Spliterators$ArraySpliterator.tryAdvance(Spliterators.java:958)
    [junit] 	at java.util.stream.ReferencePipeline.forEachWithCancel(ReferencePipeline.java:126)
    [junit] 	at java.util.stream.AbstractPipeline.copyIntoWithCancel(AbstractPipeline.java:498)
    [junit] 	at java.util.stream.AbstractPipeline.copyInto(AbstractPipeline.java:485)
    [junit] 	at java.util.stream.AbstractPipeline.wrapAndCopyInto(AbstractPipeline.java:471)
    [junit] 	at java.util.stream.FindOps$FindOp.evaluateSequential(FindOps.java:152)
    [junit] 	at java.util.stream.AbstractPipeline.evaluate(AbstractPipeline.java:234)
    [junit] 	at java.util.stream.ReferencePipeline.findFirst(ReferencePipeline.java:464)
    [junit] 	at org.openqa.selenium.remote.ProtocolHandshake.createSession(ProtocolHandshake.java:362)
    [junit] 	at org.openqa.selenium.remote.ProtocolHandshake.createSession(ProtocolHandshake.java:136)
    [junit] 	at org.openqa.selenium.remote.HttpCommandExecutor.execute(HttpCommandExecutor.java:142)
    [junit] 	at org.openqa.selenium.remote.service.DriverCommandExecutor.execute(DriverCommandExecutor.java:83)
    [junit] 	at org.openqa.selenium.remote.RemoteWebDriver.execute(RemoteWebDriver.java:586)
    [junit] 	at org.openqa.selenium.remote.RemoteWebDriver.startSession(RemoteWebDriver.java:217)
    [junit] 	at org.openqa.selenium.remote.RemoteWebDriver.<init>(RemoteWebDriver.java:140)
    [junit] 	at org.openqa.selenium.chrome.ChromeDriver.<init>(ChromeDriver.java:181)
    [junit] 	at org.openqa.selenium.chrome.ChromeDriver.<init>(ChromeDriver.java:168)
    [junit] 	at org.openqa.selenium.chrome.ChromeDriver.<init>(ChromeDriver.java:157)
    [junit] 	at jmri.util.web.BrowserFactory.getBrowser(BrowserFactory.java:59)
    [junit] 	at jmri.web.WebServerAcceptanceSteps.lambda$new$1(WebServerAcceptanceSteps.java:39)
    [junit] 	at cucumber.runtime.Utils$1.call(Utils.java:40)
    [junit] 	at cucumber.runtime.Timeout.timeout(Timeout.java:16)
    [junit] 	at cucumber.runtime.Utils.invoke(Utils.java:34)
    [junit] 	at cucumber.runtime.java8.Java8StepDefinition.execute(Java8StepDefinition.java:106)
    [junit] 	at cucumber.runtime.StepDefinitionMatch.runStep(StepDefinitionMatch.java:40)
    [junit] 	at cucumber.api.TestStep.executeStep(TestStep.java:102)
    [junit] 	at cucumber.api.TestStep.run(TestStep.java:83)
    [junit] 	at cucumber.api.TestCase.run(TestCase.java:58)
    [junit] 	at cucumber.runner.Runner.runPickle(Runner.java:80)
    [junit] 	at cucumber.runtime.junit.PickleRunners$NoStepDescriptions.run(PickleRunners.java:140)
    [junit] 	at cucumber.runtime.junit.FeatureRunner.runChild(FeatureRunner.java:68)
    [junit] 	at cucumber.runtime.junit.FeatureRunner.runChild(FeatureRunner.java:23)
    [junit] 	at cucumber.runtime.junit.FeatureRunner.run(FeatureRunner.java:73)
    [junit] 	at cucumber.api.junit.Cucumber.runChild(Cucumber.java:99)
    [junit] 	at cucumber.api.junit.Cucumber.runChild(Cucumber.java:41)
    [junit] 	at cucumber.api.junit.Cucumber$1.evaluate(Cucumber.java:108)
    [junit] 	at ✽.I am using chrome(java/acceptancetest/features/web/WebServer.feature:5)
    [junit] 
    [junit] 
    [junit] Testcase: Web Panel requests(JMRI Web Panel):	Caused an ERROR
    [junit] org/rauschig/jarchivelib/ArchiveFormat
    [junit] java.lang.NoClassDefFoundError: org/rauschig/jarchivelib/ArchiveFormat
    [junit] 	at io.github.bonigarcia.wdm.Downloader.unTarGz(Downloader.java:275)
    [junit] 	at io.github.bonigarcia.wdm.Downloader.extract(Downloader.java:188)
    [junit] 	at io.github.bonigarcia.wdm.Downloader.downloadAndExtract(Downloader.java:138)
    [junit] 	at io.github.bonigarcia.wdm.Downloader.download(Downloader.java:81)
    [junit] 	at io.github.bonigarcia.wdm.WebDriverManager.downloadCandidateUrls(WebDriverManager.java:723)
    [junit] 	at io.github.bonigarcia.wdm.WebDriverManager.manage(WebDriverManager.java:536)
    [junit] 	at io.github.bonigarcia.wdm.WebDriverManager.setup(WebDriverManager.java:260)
    [junit] 	at jmri.util.web.BrowserFactory.getBrowser(BrowserFactory.java:38)
    [junit] 	at jmri.web.WebServerAcceptanceSteps.lambda$new$0(WebServerAcceptanceSteps.java:35)
    [junit] 	at cucumber.runtime.Utils$1.call(Utils.java:40)
    [junit] 	at cucumber.runtime.Timeout.timeout(Timeout.java:16)
    [junit] 	at cucumber.runtime.Utils.invoke(Utils.java:34)
    [junit] 	at cucumber.runtime.java8.Java8StepDefinition.execute(Java8StepDefinition.java:106)
    [junit] 	at cucumber.runtime.StepDefinitionMatch.runStep(StepDefinitionMatch.java:40)
    [junit] 	at cucumber.api.TestStep.executeStep(TestStep.java:102)
    [junit] 	at cucumber.api.TestStep.run(TestStep.java:83)
    [junit] 	at cucumber.api.TestCase.run(TestCase.java:58)
    [junit] 	at cucumber.runner.Runner.runPickle(Runner.java:80)
    [junit] 	at cucumber.runtime.junit.PickleRunners$NoStepDescriptions.run(PickleRunners.java:140)
    [junit] 	at cucumber.runtime.junit.FeatureRunner.runChild(FeatureRunner.java:68)
    [junit] 	at cucumber.runtime.junit.FeatureRunner.runChild(FeatureRunner.java:23)
    [junit] 	at cucumber.runtime.junit.FeatureRunner.run(FeatureRunner.java:73)
    [junit] 	at cucumber.api.junit.Cucumber.runChild(Cucumber.java:99)
    [junit] 	at cucumber.api.junit.Cucumber.runChild(Cucumber.java:41)
    [junit] 	at cucumber.api.junit.Cucumber$1.evaluate(Cucumber.java:108)
    [junit] 	at ✽.I am using firefox(java/acceptancetest/features/web/WebTable.feature:5)
    [junit] 
    [junit] 
    [junit] Testcase: Web Panel requests(JMRI Web Panel):	Caused an ERROR
    [junit] org/rauschig/jarchivelib/ArchiveFormat
    [junit] java.lang.NoClassDefFoundError: org/rauschig/jarchivelib/ArchiveFormat
    [junit] 	at io.github.bonigarcia.wdm.Downloader.unTarGz(Downloader.java:275)
    [junit] 	at io.github.bonigarcia.wdm.Downloader.extract(Downloader.java:188)
    [junit] 	at io.github.bonigarcia.wdm.Downloader.downloadAndExtract(Downloader.java:138)
    [junit] 	at io.github.bonigarcia.wdm.Downloader.download(Downloader.java:81)
    [junit] 	at io.github.bonigarcia.wdm.WebDriverManager.downloadCandidateUrls(WebDriverManager.java:723)
    [junit] 	at io.github.bonigarcia.wdm.WebDriverManager.manage(WebDriverManager.java:536)
    [junit] 	at io.github.bonigarcia.wdm.WebDriverManager.setup(WebDriverManager.java:260)
    [junit] 	at jmri.util.web.BrowserFactory.getBrowser(BrowserFactory.java:38)
    [junit] 	at jmri.web.WebServerAcceptanceSteps.lambda$new$0(WebServerAcceptanceSteps.java:35)
    [junit] 	at cucumber.runtime.Utils$1.call(Utils.java:40)
    [junit] 	at cucumber.runtime.Timeout.timeout(Timeout.java:16)
    [junit] 	at cucumber.runtime.Utils.invoke(Utils.java:34)
    [junit] 	at cucumber.runtime.java8.Java8StepDefinition.execute(Java8StepDefinition.java:106)
    [junit] 	at cucumber.runtime.StepDefinitionMatch.runStep(StepDefinitionMatch.java:40)
    [junit] 	at cucumber.api.TestStep.executeStep(TestStep.java:102)
    [junit] 	at cucumber.api.TestStep.run(TestStep.java:83)
    [junit] 	at cucumber.api.TestCase.run(TestCase.java:58)
    [junit] 	at cucumber.runner.Runner.runPickle(Runner.java:80)
    [junit] 	at cucumber.runtime.junit.PickleRunners$NoStepDescriptions.run(PickleRunners.java:140)
    [junit] 	at cucumber.runtime.junit.FeatureRunner.runChild(FeatureRunner.java:68)
    [junit] 	at cucumber.runtime.junit.FeatureRunner.runChild(FeatureRunner.java:23)
    [junit] 	at cucumber.runtime.junit.FeatureRunner.run(FeatureRunner.java:73)
    [junit] 	at cucumber.api.junit.Cucumber.runChild(Cucumber.java:99)
    [junit] 	at cucumber.api.junit.Cucumber.runChild(Cucumber.java:41)
    [junit] 	at cucumber.api.junit.Cucumber$1.evaluate(Cucumber.java:108)
    [junit] 	at ✽.I am using firefox(java/acceptancetest/features/web/WebTable.feature:5)
    [junit] 
    [junit] 
    [junit] Testcase: Web Panel requests(JMRI Web Panel):	Caused an ERROR
    [junit] unknown error: cannot find Chrome binary
    [junit] Build info: version: '3.6.0', revision: '6fbf3ec767', time: '2017-09-27T16:15:40.131Z'
    [junit] System info: host: 'xvm50620.vps.cloud.tagadab.com', ip: '31.172.250.170', os.name: 'Linux', os.arch: 'amd64', os.version: '4.4.0-112-generic', java.version: '1.8.0_181'
    [junit] Driver info: driver.version: ChromeDriver
    [junit] remote stacktrace: #0 0x556d694b7299 <unknown>
    [junit] 
    [junit] org.openqa.selenium.WebDriverException: unknown error: cannot find Chrome binary
    [junit] Build info: version: '3.6.0', revision: '6fbf3ec767', time: '2017-09-27T16:15:40.131Z'
    [junit] System info: host: 'xvm50620.vps.cloud.tagadab.com', ip: '31.172.250.170', os.name: 'Linux', os.arch: 'amd64', os.version: '4.4.0-112-generic', java.version: '1.8.0_181'
    [junit] Driver info: driver.version: ChromeDriver
    [junit] remote stacktrace: #0 0x556d694b7299 <unknown>
    [junit] 
    [junit] 	at java.lang.reflect.Constructor.newInstance(Constructor.java:423)
    [junit] 	at org.openqa.selenium.remote.W3CHandshakeResponse.lambda$new$0(W3CHandshakeResponse.java:57)
    [junit] 	at org.openqa.selenium.remote.W3CHandshakeResponse.lambda$getResponseFunction$2(W3CHandshakeResponse.java:104)
    [junit] 	at org.openqa.selenium.remote.ProtocolHandshake.lambda$createSession$24(ProtocolHandshake.java:359)
    [junit] 	at java.util.stream.ReferencePipeline$3$1.accept(ReferencePipeline.java:193)
    [junit] 	at java.util.Spliterators$ArraySpliterator.tryAdvance(Spliterators.java:958)
    [junit] 	at java.util.stream.ReferencePipeline.forEachWithCancel(ReferencePipeline.java:126)
    [junit] 	at java.util.stream.AbstractPipeline.copyIntoWithCancel(AbstractPipeline.java:498)
    [junit] 	at java.util.stream.AbstractPipeline.copyInto(AbstractPipeline.java:485)
    [junit] 	at java.util.stream.AbstractPipeline.wrapAndCopyInto(AbstractPipeline.java:471)
    [junit] 	at java.util.stream.FindOps$FindOp.evaluateSequential(FindOps.java:152)
    [junit] 	at java.util.stream.AbstractPipeline.evaluate(AbstractPipeline.java:234)
    [junit] 	at java.util.stream.ReferencePipeline.findFirst(ReferencePipeline.java:464)
    [junit] 	at org.openqa.selenium.remote.ProtocolHandshake.createSession(ProtocolHandshake.java:362)
    [junit] 	at org.openqa.selenium.remote.ProtocolHandshake.createSession(ProtocolHandshake.java:136)
    [junit] 	at org.openqa.selenium.remote.HttpCommandExecutor.execute(HttpCommandExecutor.java:142)
    [junit] 	at org.openqa.selenium.remote.service.DriverCommandExecutor.execute(DriverCommandExecutor.java:83)
    [junit] 	at org.openqa.selenium.remote.RemoteWebDriver.execute(RemoteWebDriver.java:586)
    [junit] 	at org.openqa.selenium.remote.RemoteWebDriver.startSession(RemoteWebDriver.java:217)
    [junit] 	at org.openqa.selenium.remote.RemoteWebDriver.<init>(RemoteWebDriver.java:140)
    [junit] 	at org.openqa.selenium.chrome.ChromeDriver.<init>(ChromeDriver.java:181)
    [junit] 	at org.openqa.selenium.chrome.ChromeDriver.<init>(ChromeDriver.java:168)
    [junit] 	at org.openqa.selenium.chrome.ChromeDriver.<init>(ChromeDriver.java:157)
    [junit] 	at jmri.util.web.BrowserFactory.getBrowser(BrowserFactory.java:59)
    [junit] 	at jmri.web.WebServerAcceptanceSteps.lambda$new$1(WebServerAcceptanceSteps.java:39)
    [junit] 	at cucumber.runtime.Utils$1.call(Utils.java:40)
    [junit] 	at cucumber.runtime.Timeout.timeout(Timeout.java:16)
    [junit] 	at cucumber.runtime.Utils.invoke(Utils.java:34)
    [junit] 	at cucumber.runtime.java8.Java8StepDefinition.execute(Java8StepDefinition.java:106)
    [junit] 	at cucumber.runtime.StepDefinitionMatch.runStep(StepDefinitionMatch.java:40)
    [junit] 	at cucumber.api.TestStep.executeStep(TestStep.java:102)
    [junit] 	at cucumber.api.TestStep.run(TestStep.java:83)
    [junit] 	at cucumber.api.TestCase.run(TestCase.java:58)
    [junit] 	at cucumber.runner.Runner.runPickle(Runner.java:80)
    [junit] 	at cucumber.runtime.junit.PickleRunners$NoStepDescriptions.run(PickleRunners.java:140)
    [junit] 	at cucumber.runtime.junit.FeatureRunner.runChild(FeatureRunner.java:68)
    [junit] 	at cucumber.runtime.junit.FeatureRunner.runChild(FeatureRunner.java:23)
    [junit] 	at cucumber.runtime.junit.FeatureRunner.run(FeatureRunner.java:73)
    [junit] 	at cucumber.api.junit.Cucumber.runChild(Cucumber.java:99)
    [junit] 	at cucumber.api.junit.Cucumber.runChild(Cucumber.java:41)
    [junit] 	at cucumber.api.junit.Cucumber$1.evaluate(Cucumber.java:108)
    [junit] 	at ✽.I am using chrome(java/acceptancetest/features/web/WebTable.feature:5)
    [junit] 
    [junit] 
    [junit] Testcase: Web Panel requests(JMRI Web Panel):	Caused an ERROR
    [junit] unknown error: cannot find Chrome binary
    [junit] Build info: version: '3.6.0', revision: '6fbf3ec767', time: '2017-09-27T16:15:40.131Z'
    [junit] System info: host: 'xvm50620.vps.cloud.tagadab.com', ip: '31.172.250.170', os.name: 'Linux', os.arch: 'amd64', os.version: '4.4.0-112-generic', java.version: '1.8.0_181'
    [junit] Driver info: driver.version: ChromeDriver
    [junit] remote stacktrace: #0 0x5573f4d64299 <unknown>
    [junit] 
    [junit] org.openqa.selenium.WebDriverException: unknown error: cannot find Chrome binary
    [junit] Build info: version: '3.6.0', revision: '6fbf3ec767', time: '2017-09-27T16:15:40.131Z'
    [junit] System info: host: 'xvm50620.vps.cloud.tagadab.com', ip: '31.172.250.170', os.name: 'Linux', os.arch: 'amd64', os.version: '4.4.0-112-generic', java.version: '1.8.0_181'
    [junit] Driver info: driver.version: ChromeDriver
    [junit] remote stacktrace: #0 0x5573f4d64299 <unknown>
    [junit] 
    [junit] 	at java.lang.reflect.Constructor.newInstance(Constructor.java:423)
    [junit] 	at org.openqa.selenium.remote.W3CHandshakeResponse.lambda$new$0(W3CHandshakeResponse.java:57)
    [junit] 	at org.openqa.selenium.remote.W3CHandshakeResponse.lambda$getResponseFunction$2(W3CHandshakeResponse.java:104)
    [junit] 	at org.openqa.selenium.remote.ProtocolHandshake.lambda$createSession$24(ProtocolHandshake.java:359)
    [junit] 	at java.util.stream.ReferencePipeline$3$1.accept(ReferencePipeline.java:193)
    [junit] 	at java.util.Spliterators$ArraySpliterator.tryAdvance(Spliterators.java:958)
    [junit] 	at java.util.stream.ReferencePipeline.forEachWithCancel(ReferencePipeline.java:126)
    [junit] 	at java.util.stream.AbstractPipeline.copyIntoWithCancel(AbstractPipeline.java:498)
    [junit] 	at java.util.stream.AbstractPipeline.copyInto(AbstractPipeline.java:485)
    [junit] 	at java.util.stream.AbstractPipeline.wrapAndCopyInto(AbstractPipeline.java:471)
    [junit] 	at java.util.stream.FindOps$FindOp.evaluateSequential(FindOps.java:152)
    [junit] 	at java.util.stream.AbstractPipeline.evaluate(AbstractPipeline.java:234)
    [junit] 	at java.util.stream.ReferencePipeline.findFirst(ReferencePipeline.java:464)
    [junit] 	at org.openqa.selenium.remote.ProtocolHandshake.createSession(ProtocolHandshake.java:362)
    [junit] 	at org.openqa.selenium.remote.ProtocolHandshake.createSession(ProtocolHandshake.java:136)
    [junit] 	at org.openqa.selenium.remote.HttpCommandExecutor.execute(HttpCommandExecutor.java:142)
    [junit] 	at org.openqa.selenium.remote.service.DriverCommandExecutor.execute(DriverCommandExecutor.java:83)
    [junit] 	at org.openqa.selenium.remote.RemoteWebDriver.execute(RemoteWebDriver.java:586)
    [junit] 	at org.openqa.selenium.remote.RemoteWebDriver.startSession(RemoteWebDriver.java:217)
    [junit] 	at org.openqa.selenium.remote.RemoteWebDriver.<init>(RemoteWebDriver.java:140)
    [junit] 	at org.openqa.selenium.chrome.ChromeDriver.<init>(ChromeDriver.java:181)
    [junit] 	at org.openqa.selenium.chrome.ChromeDriver.<init>(ChromeDriver.java:168)
    [junit] 	at org.openqa.selenium.chrome.ChromeDriver.<init>(ChromeDriver.java:157)
    [junit] 	at jmri.util.web.BrowserFactory.getBrowser(BrowserFactory.java:59)
    [junit] 	at jmri.web.WebServerAcceptanceSteps.lambda$new$1(WebServerAcceptanceSteps.java:39)
    [junit] 	at cucumber.runtime.Utils$1.call(Utils.java:40)
    [junit] 	at cucumber.runtime.Timeout.timeout(Timeout.java:16)
    [junit] 	at cucumber.runtime.Utils.invoke(Utils.java:34)
    [junit] 	at cucumber.runtime.java8.Java8StepDefinition.execute(Java8StepDefinition.java:106)
    [junit] 	at cucumber.runtime.StepDefinitionMatch.runStep(StepDefinitionMatch.java:40)
    [junit] 	at cucumber.api.TestStep.executeStep(TestStep.java:102)
    [junit] 	at cucumber.api.TestStep.run(TestStep.java:83)
    [junit] 	at cucumber.api.TestCase.run(TestCase.java:58)
    [junit] 	at cucumber.runner.Runner.runPickle(Runner.java:80)
    [junit] 	at cucumber.runtime.junit.PickleRunners$NoStepDescriptions.run(PickleRunners.java:140)
    [junit] 	at cucumber.runtime.junit.FeatureRunner.runChild(FeatureRunner.java:68)
    [junit] 	at cucumber.runtime.junit.FeatureRunner.runChild(FeatureRunner.java:23)
    [junit] 	at cucumber.runtime.junit.FeatureRunner.run(FeatureRunner.java:73)
    [junit] 	at cucumber.api.junit.Cucumber.runChild(Cucumber.java:99)
    [junit] 	at cucumber.api.junit.Cucumber.runChild(Cucumber.java:41)
    [junit] 	at cucumber.api.junit.Cucumber$1.evaluate(Cucumber.java:108)
    [junit] 	at ✽.I am using chrome(java/acceptancetest/features/web/WebTable.feature:5)
    [junit] 
    [junit] 
    [junit] Test jmri.RunCucumberTest FAILED

BUILD FAILED
/var/lib/jenkins/jobs/Development/jobs/Cucumber/workspace/build.xml:1637: condition satisfied

Total time: 3 minutes 14 seconds
Build step 'Invoke Ant' marked build as failure
Xvfb stopping
Recording test results
[CucumberReport] Using Cucumber Reports version 4.6.0
[CucumberReport] JSON report directory is ""
[CucumberReport] Copied 617 json files from workspace "/var/lib/jenkins/jobs/Development/jobs/Cucumber/workspace" to reports directory "/var/lib/jenkins/jobs/Development/jobs/Cucumber/builds/1/cucumber-html-reports/.cache"
[CucumberReport] Copied 3237 properties files from workspace "/var/lib/jenkins/jobs/Development/jobs/Cucumber/workspace" to reports directory "/var/lib/jenkins/jobs/Development/jobs/Cucumber/builds/1/cucumber-html-reports/.cache"
[CucumberReport] Processing 617 json files:
[CucumberReport] /var/lib/jenkins/jobs/Development/jobs/Cucumber/builds/1/cucumber-html-reports/.cache/.vscode/settings.json
[CucumberReport] /var/lib/jenkins/jobs/Development/jobs/Cucumber/builds/1/cucumber-html-reports/.cache/cucumber-results.json
[CucumberReport] /var/lib/jenkins/jobs/Development/jobs/Cucumber/builds/1/cucumber-html-reports/.cache/java/src/jmri/server/json/block/block-client.json
[CucumberReport] /var/lib/jenkins/jobs/Development/jobs/Cucumber/builds/1/cucumber-html-reports/.cache/java/src/jmri/server/json/block/block-server.json
[CucumberReport] /var/lib/jenkins/jobs/Development/jobs/Cucumber/builds/1/cucumber-html-reports/.cache/java/src/jmri/server/json/consist/consist-client.json
[CucumberReport] /var/lib/jenkins/jobs/Development/jobs/Cucumber/builds/1/cucumber-html-reports/.cache/java/src/jmri/server/json/consist/consist-server.json
[CucumberReport] /var/lib/jenkins/jobs/Development/jobs/Cucumber/builds/1/cucumber-html-reports/.cache/java/src/jmri/server/json/layoutblock/layoutBlock-client.json
[CucumberReport] /var/lib/jenkins/jobs/Development/jobs/Cucumber/builds/1/cucumber-html-reports/.cache/java/src/jmri/server/json/layoutblock/layoutBlock-server.json
[CucumberReport] /var/lib/jenkins/jobs/Development/jobs/Cucumber/builds/1/cucumber-html-reports/.cache/java/src/jmri/server/json/light/light-client.json
[CucumberReport] /var/lib/jenkins/jobs/Development/jobs/Cucumber/builds/1/cucumber-html-reports/.cache/java/src/jmri/server/json/light/light-server.json
[CucumberReport] /var/lib/jenkins/jobs/Development/jobs/Cucumber/builds/1/cucumber-html-reports/.cache/java/src/jmri/server/json/memory/memory-client.json
[CucumberReport] /var/lib/jenkins/jobs/Development/jobs/Cucumber/builds/1/cucumber-html-reports/.cache/java/src/jmri/server/json/memory/memory-server.json
[CucumberReport] /var/lib/jenkins/jobs/Development/jobs/Cucumber/builds/1/cucumber-html-reports/.cache/java/src/jmri/server/json/message/client-client.json
[CucumberReport] /var/lib/jenkins/jobs/Development/jobs/Cucumber/builds/1/cucumber-html-reports/.cache/java/src/jmri/server/json/message/client-server.json
[CucumberReport] /var/lib/jenkins/jobs/Development/jobs/Cucumber/builds/1/cucumber-html-reports/.cache/java/src/jmri/server/json/message/message-server.json
[CucumberReport] /var/lib/jenkins/jobs/Development/jobs/Cucumber/builds/1/cucumber-html-reports/.cache/java/src/jmri/server/json/operations/car-client.json
[CucumberReport] /var/lib/jenkins/jobs/Development/jobs/Cucumber/builds/1/cucumber-html-reports/.cache/java/src/jmri/server/json/operations/car-server.json
[CucumberReport] /var/lib/jenkins/jobs/Development/jobs/Cucumber/builds/1/cucumber-html-reports/.cache/java/src/jmri/server/json/operations/engine-client.json
[CucumberReport] /var/lib/jenkins/jobs/Development/jobs/Cucumber/builds/1/cucumber-html-reports/.cache/java/src/jmri/server/json/operations/engine-server.json
[CucumberReport] /var/lib/jenkins/jobs/Development/jobs/Cucumber/builds/1/cucumber-html-reports/.cache/java/src/jmri/server/json/operations/location-client.json
[CucumberReport] /var/lib/jenkins/jobs/Development/jobs/Cucumber/builds/1/cucumber-html-reports/.cache/java/src/jmri/server/json/operations/location-server.json
[CucumberReport] /var/lib/jenkins/jobs/Development/jobs/Cucumber/builds/1/cucumber-html-reports/.cache/java/src/jmri/server/json/operations/train-client.json
[CucumberReport] /var/lib/jenkins/jobs/Development/jobs/Cucumber/builds/1/cucumber-html-reports/.cache/java/src/jmri/server/json/operations/train-server.json
[CucumberReport] /var/lib/jenkins/jobs/Development/jobs/Cucumber/builds/1/cucumber-html-reports/.cache/java/src/jmri/server/json/power/power-client.json
[CucumberReport] /var/lib/jenkins/jobs/Development/jobs/Cucumber/builds/1/cucumber-html-reports/.cache/java/src/jmri/server/json/power/power-server.json
[CucumberReport] /var/lib/jenkins/jobs/Development/jobs/Cucumber/builds/1/cucumber-html-reports/.cache/java/src/jmri/server/json/reporter/reporter-client.json
[CucumberReport] /var/lib/jenkins/jobs/Development/jobs/Cucumber/builds/1/cucumber-html-reports/.cache/java/src/jmri/server/json/reporter/reporter-server.json
[CucumberReport] /var/lib/jenkins/jobs/Development/jobs/Cucumber/builds/1/cucumber-html-reports/.cache/java/src/jmri/server/json/roster/roster-client.json
[CucumberReport] /var/lib/jenkins/jobs/Development/jobs/Cucumber/builds/1/cucumber-html-reports/.cache/java/src/jmri/server/json/roster/roster-server.json
[CucumberReport] /var/lib/jenkins/jobs/Development/jobs/Cucumber/builds/1/cucumber-html-reports/.cache/java/src/jmri/server/json/roster/rosterEntry-client.json
[CucumberReport] /var/lib/jenkins/jobs/Development/jobs/Cucumber/builds/1/cucumber-html-reports/.cache/java/src/jmri/server/json/roster/rosterEntry-server.json
[CucumberReport] /var/lib/jenkins/jobs/Development/jobs/Cucumber/builds/1/cucumber-html-reports/.cache/java/src/jmri/server/json/roster/rosterGroup-client.json
[CucumberReport] /var/lib/jenkins/jobs/Development/jobs/Cucumber/builds/1/cucumber-html-reports/.cache/java/src/jmri/server/json/roster/rosterGroup-server.json
[CucumberReport] /var/lib/jenkins/jobs/Development/jobs/Cucumber/builds/1/cucumber-html-reports/.cache/java/src/jmri/server/json/route/route-client.json
[CucumberReport] /var/lib/jenkins/jobs/Development/jobs/Cucumber/builds/1/cucumber-html-reports/.cache/java/src/jmri/server/json/route/route-server.json
[CucumberReport] /var/lib/jenkins/jobs/Development/jobs/Cucumber/builds/1/cucumber-html-reports/.cache/java/src/jmri/server/json/schema/empty-data.json
[CucumberReport] /var/lib/jenkins/jobs/Development/jobs/Cucumber/builds/1/cucumber-html-reports/.cache/java/src/jmri/server/json/schema/json-client.json
[CucumberReport] /var/lib/jenkins/jobs/Development/jobs/Cucumber/builds/1/cucumber-html-reports/.cache/java/src/jmri/server/json/schema/json-server.json
[CucumberReport] /var/lib/jenkins/jobs/Development/jobs/Cucumber/builds/1/cucumber-html-reports/.cache/java/src/jmri/server/json/schema/schema-client.json
[CucumberReport] /var/lib/jenkins/jobs/Development/jobs/Cucumber/builds/1/cucumber-html-reports/.cache/java/src/jmri/server/json/schema/schema-server.json
[CucumberReport] /var/lib/jenkins/jobs/Development/jobs/Cucumber/builds/1/cucumber-html-reports/.cache/java/src/jmri/server/json/schema/type-client.json
[CucumberReport] /var/lib/jenkins/jobs/Development/jobs/Cucumber/builds/1/cucumber-html-reports/.cache/java/src/jmri/server/json/schema/type-server.json
[CucumberReport] /var/lib/jenkins/jobs/Development/jobs/Cucumber/builds/1/cucumber-html-reports/.cache/java/src/jmri/server/json/sensor/sensor-client.json
[CucumberReport] /var/lib/jenkins/jobs/Development/jobs/Cucumber/builds/1/cucumber-html-reports/.cache/java/src/jmri/server/json/sensor/sensor-server.json
[CucumberReport] /var/lib/jenkins/jobs/Development/jobs/Cucumber/builds/1/cucumber-html-reports/.cache/java/src/jmri/server/json/signalHead/signalHead-client.json
[CucumberReport] /var/lib/jenkins/jobs/Development/jobs/Cucumber/builds/1/cucumber-html-reports/.cache/java/src/jmri/server/json/signalHead/signalHead-server.json
[CucumberReport] /var/lib/jenkins/jobs/Development/jobs/Cucumber/builds/1/cucumber-html-reports/.cache/java/src/jmri/server/json/signalMast/signalMast-client.json
[CucumberReport] /var/lib/jenkins/jobs/Development/jobs/Cucumber/builds/1/cucumber-html-reports/.cache/java/src/jmri/server/json/signalMast/signalMast-server.json
[CucumberReport] /var/lib/jenkins/jobs/Development/jobs/Cucumber/builds/1/cucumber-html-reports/.cache/java/src/jmri/server/json/throttle/throttle-client.json
[CucumberReport] /var/lib/jenkins/jobs/Development/jobs/Cucumber/builds/1/cucumber-html-reports/.cache/java/src/jmri/server/json/throttle/throttle-server.json
[CucumberReport] /var/lib/jenkins/jobs/Development/jobs/Cucumber/builds/1/cucumber-html-reports/.cache/java/src/jmri/server/json/time/time-client.json
[CucumberReport] /var/lib/jenkins/jobs/Development/jobs/Cucumber/builds/1/cucumber-html-reports/.cache/java/src/jmri/server/json/time/time-server.json
[CucumberReport] /var/lib/jenkins/jobs/Development/jobs/Cucumber/builds/1/cucumber-html-reports/.cache/java/src/jmri/server/json/turnout/turnout-client.json
[CucumberReport] /var/lib/jenkins/jobs/Development/jobs/Cucumber/builds/1/cucumber-html-reports/.cache/java/src/jmri/server/json/turnout/turnout-server.json
[CucumberReport] /var/lib/jenkins/jobs/Development/jobs/Cucumber/builds/1/cucumber-html-reports/.cache/java/src/jmri/server/json/util/configProfile-client.json
[CucumberReport] /var/lib/jenkins/jobs/Development/jobs/Cucumber/builds/1/cucumber-html-reports/.cache/java/src/jmri/server/json/util/configProfile-server.json
[CucumberReport] /var/lib/jenkins/jobs/Development/jobs/Cucumber/builds/1/cucumber-html-reports/.cache/java/src/jmri/server/json/util/error-server.json
[CucumberReport] /var/lib/jenkins/jobs/Development/jobs/Cucumber/builds/1/cucumber-html-reports/.cache/java/src/jmri/server/json/util/goodbye-client.json
[CucumberReport] /var/lib/jenkins/jobs/Development/jobs/Cucumber/builds/1/cucumber-html-reports/.cache/java/src/jmri/server/json/util/goodbye-server.json
[CucumberReport] /var/lib/jenkins/jobs/Development/jobs/Cucumber/builds/1/cucumber-html-reports/.cache/java/src/jmri/server/json/util/hello-client.json
[CucumberReport] /var/lib/jenkins/jobs/Development/jobs/Cucumber/builds/1/cucumber-html-reports/.cache/java/src/jmri/server/json/util/hello-server.json
[CucumberReport] /var/lib/jenkins/jobs/Development/jobs/Cucumber/builds/1/cucumber-html-reports/.cache/java/src/jmri/server/json/util/locale-client.json
[CucumberReport] /var/lib/jenkins/jobs/Development/jobs/Cucumber/builds/1/cucumber-html-reports/.cache/java/src/jmri/server/json/util/metadata-client.json
[CucumberReport] /var/lib/jenkins/jobs/Development/jobs/Cucumber/builds/1/cucumber-html-reports/.cache/java/src/jmri/server/json/util/metadata-server.json
[CucumberReport] /var/lib/jenkins/jobs/Development/jobs/Cucumber/builds/1/cucumber-html-reports/.cache/java/src/jmri/server/json/util/networkService-client.json
[CucumberReport] /var/lib/jenkins/jobs/Development/jobs/Cucumber/builds/1/cucumber-html-reports/.cache/java/src/jmri/server/json/util/networkService-server.json
[CucumberReport] /var/lib/jenkins/jobs/Development/jobs/Cucumber/builds/1/cucumber-html-reports/.cache/java/src/jmri/server/json/util/node-client.json
[CucumberReport] /var/lib/jenkins/jobs/Development/jobs/Cucumber/builds/1/cucumber-html-reports/.cache/java/src/jmri/server/json/util/node-server.json
[CucumberReport] /var/lib/jenkins/jobs/Development/jobs/Cucumber/builds/1/cucumber-html-reports/.cache/java/src/jmri/server/json/util/panel-client.json
[CucumberReport] /var/lib/jenkins/jobs/Development/jobs/Cucumber/builds/1/cucumber-html-reports/.cache/java/src/jmri/server/json/util/panel-server.json
[CucumberReport] /var/lib/jenkins/jobs/Development/jobs/Cucumber/builds/1/cucumber-html-reports/.cache/java/src/jmri/server/json/util/ping-client.json
[CucumberReport] /var/lib/jenkins/jobs/Development/jobs/Cucumber/builds/1/cucumber-html-reports/.cache/java/src/jmri/server/json/util/pong-server.json
[CucumberReport] /var/lib/jenkins/jobs/Development/jobs/Cucumber/builds/1/cucumber-html-reports/.cache/java/src/jmri/server/json/util/railroad-client.json
[CucumberReport] /var/lib/jenkins/jobs/Development/jobs/Cucumber/builds/1/cucumber-html-reports/.cache/java/src/jmri/server/json/util/railroad-server.json
[CucumberReport] /var/lib/jenkins/jobs/Development/jobs/Cucumber/builds/1/cucumber-html-reports/.cache/java/src/jmri/server/json/util/systemConnection-client.json
[CucumberReport] /var/lib/jenkins/jobs/Development/jobs/Cucumber/builds/1/cucumber-html-reports/.cache/java/src/jmri/server/json/util/systemConnection-server.json
[CucumberReport] /var/lib/jenkins/jobs/Development/jobs/Cucumber/builds/1/cucumber-html-reports/.cache/target/classes/jmri/server/json/block/block-client.json
[CucumberReport] /var/lib/jenkins/jobs/Development/jobs/Cucumber/builds/1/cucumber-html-reports/.cache/target/classes/jmri/server/json/block/block-server.json
[CucumberReport] /var/lib/jenkins/jobs/Development/jobs/Cucumber/builds/1/cucumber-html-reports/.cache/target/classes/jmri/server/json/consist/consist-client.json
[CucumberReport] /var/lib/jenkins/jobs/Development/jobs/Cucumber/builds/1/cucumber-html-reports/.cache/target/classes/jmri/server/json/consist/consist-server.json
[CucumberReport] /var/lib/jenkins/jobs/Development/jobs/Cucumber/builds/1/cucumber-html-reports/.cache/target/classes/jmri/server/json/layoutblock/layoutBlock-client.json
[CucumberReport] /var/lib/jenkins/jobs/Development/jobs/Cucumber/builds/1/cucumber-html-reports/.cache/target/classes/jmri/server/json/layoutblock/layoutBlock-server.json
[CucumberReport] /var/lib/jenkins/jobs/Development/jobs/Cucumber/builds/1/cucumber-html-reports/.cache/target/classes/jmri/server/json/light/light-client.json
[CucumberReport] /var/lib/jenkins/jobs/Development/jobs/Cucumber/builds/1/cucumber-html-reports/.cache/target/classes/jmri/server/json/light/light-server.json
[CucumberReport] /var/lib/jenkins/jobs/Development/jobs/Cucumber/builds/1/cucumber-html-reports/.cache/target/classes/jmri/server/json/memory/memory-client.json
[CucumberReport] /var/lib/jenkins/jobs/Development/jobs/Cucumber/builds/1/cucumber-html-reports/.cache/target/classes/jmri/server/json/memory/memory-server.json
[CucumberReport] /var/lib/jenkins/jobs/Development/jobs/Cucumber/builds/1/cucumber-html-reports/.cache/target/classes/jmri/server/json/message/client-client.json
[CucumberReport] /var/lib/jenkins/jobs/Development/jobs/Cucumber/builds/1/cucumber-html-reports/.cache/target/classes/jmri/server/json/message/client-server.json
[CucumberReport] /var/lib/jenkins/jobs/Development/jobs/Cucumber/builds/1/cucumber-html-reports/.cache/target/classes/jmri/server/json/message/message-server.json
[CucumberReport] /var/lib/jenkins/jobs/Development/jobs/Cucumber/builds/1/cucumber-html-reports/.cache/target/classes/jmri/server/json/operations/car-client.json
[CucumberReport] /var/lib/jenkins/jobs/Development/jobs/Cucumber/builds/1/cucumber-html-reports/.cache/target/classes/jmri/server/json/operations/car-server.json
[CucumberReport] /var/lib/jenkins/jobs/Development/jobs/Cucumber/builds/1/cucumber-html-reports/.cache/target/classes/jmri/server/json/operations/engine-client.json
[CucumberReport] /var/lib/jenkins/jobs/Development/jobs/Cucumber/builds/1/cucumber-html-reports/.cache/target/classes/jmri/server/json/operations/engine-server.json
[CucumberReport] /var/lib/jenkins/jobs/Development/jobs/Cucumber/builds/1/cucumber-html-reports/.cache/target/classes/jmri/server/json/operations/location-client.json
[CucumberReport] /var/lib/jenkins/jobs/Development/jobs/Cucumber/builds/1/cucumber-html-reports/.cache/target/classes/jmri/server/json/operations/location-server.json
[CucumberReport] /var/lib/jenkins/jobs/Development/jobs/Cucumber/builds/1/cucumber-html-reports/.cache/target/classes/jmri/server/json/operations/train-client.json
[CucumberReport] /var/lib/jenkins/jobs/Development/jobs/Cucumber/builds/1/cucumber-html-reports/.cache/target/classes/jmri/server/json/operations/train-server.json
[CucumberReport] /var/lib/jenkins/jobs/Development/jobs/Cucumber/builds/1/cucumber-html-reports/.cache/target/classes/jmri/server/json/power/power-client.json
[CucumberReport] /var/lib/jenkins/jobs/Development/jobs/Cucumber/builds/1/cucumber-html-reports/.cache/target/classes/jmri/server/json/power/power-server.json
[CucumberReport] /var/lib/jenkins/jobs/Development/jobs/Cucumber/builds/1/cucumber-html-reports/.cache/target/classes/jmri/server/json/reporter/reporter-client.json
[CucumberReport] /var/lib/jenkins/jobs/Development/jobs/Cucumber/builds/1/cucumber-html-reports/.cache/target/classes/jmri/server/json/reporter/reporter-server.json
[CucumberReport] /var/lib/jenkins/jobs/Development/jobs/Cucumber/builds/1/cucumber-html-reports/.cache/target/classes/jmri/server/json/roster/roster-client.json
[CucumberReport] /var/lib/jenkins/jobs/Development/jobs/Cucumber/builds/1/cucumber-html-reports/.cache/target/classes/jmri/server/json/roster/roster-server.json
[CucumberReport] /var/lib/jenkins/jobs/Development/jobs/Cucumber/builds/1/cucumber-html-reports/.cache/target/classes/jmri/server/json/roster/rosterEntry-client.json
[CucumberReport] /var/lib/jenkins/jobs/Development/jobs/Cucumber/builds/1/cucumber-html-reports/.cache/target/classes/jmri/server/json/roster/rosterEntry-server.json
[CucumberReport] /var/lib/jenkins/jobs/Development/jobs/Cucumber/builds/1/cucumber-html-reports/.cache/target/classes/jmri/server/json/roster/rosterGroup-client.json
[CucumberReport] /var/lib/jenkins/jobs/Development/jobs/Cucumber/builds/1/cucumber-html-reports/.cache/target/classes/jmri/server/json/roster/rosterGroup-server.json
[CucumberReport] /var/lib/jenkins/jobs/Development/jobs/Cucumber/builds/1/cucumber-html-reports/.cache/target/classes/jmri/server/json/route/route-client.json
[CucumberReport] /var/lib/jenkins/jobs/Development/jobs/Cucumber/builds/1/cucumber-html-reports/.cache/target/classes/jmri/server/json/route/route-server.json
[CucumberReport] /var/lib/jenkins/jobs/Development/jobs/Cucumber/builds/1/cucumber-html-reports/.cache/target/classes/jmri/server/json/schema/empty-data.json
[CucumberReport] /var/lib/jenkins/jobs/Development/jobs/Cucumber/builds/1/cucumber-html-reports/.cache/target/classes/jmri/server/json/schema/json-client.json
[CucumberReport] /var/lib/jenkins/jobs/Development/jobs/Cucumber/builds/1/cucumber-html-reports/.cache/target/classes/jmri/server/json/schema/json-server.json
[CucumberReport] /var/lib/jenkins/jobs/Development/jobs/Cucumber/builds/1/cucumber-html-reports/.cache/target/classes/jmri/server/json/schema/schema-client.json
[CucumberReport] /var/lib/jenkins/jobs/Development/jobs/Cucumber/builds/1/cucumber-html-reports/.cache/target/classes/jmri/server/json/schema/schema-server.json
[CucumberReport] /var/lib/jenkins/jobs/Development/jobs/Cucumber/builds/1/cucumber-html-reports/.cache/target/classes/jmri/server/json/schema/type-client.json
[CucumberReport] /var/lib/jenkins/jobs/Development/jobs/Cucumber/builds/1/cucumber-html-reports/.cache/target/classes/jmri/server/json/schema/type-server.json
[CucumberReport] /var/lib/jenkins/jobs/Development/jobs/Cucumber/builds/1/cucumber-html-reports/.cache/target/classes/jmri/server/json/sensor/sensor-client.json
[CucumberReport] /var/lib/jenkins/jobs/Development/jobs/Cucumber/builds/1/cucumber-html-reports/.cache/target/classes/jmri/server/json/sensor/sensor-server.json
[CucumberReport] /var/lib/jenkins/jobs/Development/jobs/Cucumber/builds/1/cucumber-html-reports/.cache/target/classes/jmri/server/json/signalHead/signalHead-client.json
[CucumberReport] /var/lib/jenkins/jobs/Development/jobs/Cucumber/builds/1/cucumber-html-reports/.cache/target/classes/jmri/server/json/signalHead/signalHead-server.json
[CucumberReport] /var/lib/jenkins/jobs/Development/jobs/Cucumber/builds/1/cucumber-html-reports/.cache/target/classes/jmri/server/json/signalMast/signalMast-client.json
[CucumberReport] /var/lib/jenkins/jobs/Development/jobs/Cucumber/builds/1/cucumber-html-reports/.cache/target/classes/jmri/server/json/signalMast/signalMast-server.json
[CucumberReport] /var/lib/jenkins/jobs/Development/jobs/Cucumber/builds/1/cucumber-html-reports/.cache/target/classes/jmri/server/json/throttle/throttle-client.json
[CucumberReport] /var/lib/jenkins/jobs/Development/jobs/Cucumber/builds/1/cucumber-html-reports/.cache/target/classes/jmri/server/json/throttle/throttle-server.json
[CucumberReport] /var/lib/jenkins/jobs/Development/jobs/Cucumber/builds/1/cucumber-html-reports/.cache/target/classes/jmri/server/json/time/time-client.json
[CucumberReport] /var/lib/jenkins/jobs/Development/jobs/Cucumber/builds/1/cucumber-html-reports/.cache/target/classes/jmri/server/json/time/time-server.json
[CucumberReport] /var/lib/jenkins/jobs/Development/jobs/Cucumber/builds/1/cucumber-html-reports/.cache/target/classes/jmri/server/json/turnout/turnout-client.json
[CucumberReport] /var/lib/jenkins/jobs/Development/jobs/Cucumber/builds/1/cucumber-html-reports/.cache/target/classes/jmri/server/json/turnout/turnout-server.json
[CucumberReport] /var/lib/jenkins/jobs/Development/jobs/Cucumber/builds/1/cucumber-html-reports/.cache/target/classes/jmri/server/json/util/configProfile-client.json
[CucumberReport] /var/lib/jenkins/jobs/Development/jobs/Cucumber/builds/1/cucumber-html-reports/.cache/target/classes/jmri/server/json/util/configProfile-server.json
[CucumberReport] /var/lib/jenkins/jobs/Development/jobs/Cucumber/builds/1/cucumber-html-reports/.cache/target/classes/jmri/server/json/util/error-server.json
[CucumberReport] /var/lib/jenkins/jobs/Development/jobs/Cucumber/builds/1/cucumber-html-reports/.cache/target/classes/jmri/server/json/util/goodbye-client.json
[CucumberReport] /var/lib/jenkins/jobs/Development/jobs/Cucumber/builds/1/cucumber-html-reports/.cache/target/classes/jmri/server/json/util/goodbye-server.json
[CucumberReport] /var/lib/jenkins/jobs/Development/jobs/Cucumber/builds/1/cucumber-html-reports/.cache/target/classes/jmri/server/json/util/hello-client.json
[CucumberReport] /var/lib/jenkins/jobs/Development/jobs/Cucumber/builds/1/cucumber-html-reports/.cache/target/classes/jmri/server/json/util/hello-server.json
[CucumberReport] /var/lib/jenkins/jobs/Development/jobs/Cucumber/builds/1/cucumber-html-reports/.cache/target/classes/jmri/server/json/util/locale-client.json
[CucumberReport] /var/lib/jenkins/jobs/Development/jobs/Cucumber/builds/1/cucumber-html-reports/.cache/target/classes/jmri/server/json/util/metadata-client.json
[CucumberReport] /var/lib/jenkins/jobs/Development/jobs/Cucumber/builds/1/cucumber-html-reports/.cache/target/classes/jmri/server/json/util/metadata-server.json
[CucumberReport] /var/lib/jenkins/jobs/Development/jobs/Cucumber/builds/1/cucumber-html-reports/.cache/target/classes/jmri/server/json/util/networkService-client.json
[CucumberReport] /var/lib/jenkins/jobs/Development/jobs/Cucumber/builds/1/cucumber-html-reports/.cache/target/classes/jmri/server/json/util/networkService-server.json
[CucumberReport] /var/lib/jenkins/jobs/Development/jobs/Cucumber/builds/1/cucumber-html-reports/.cache/target/classes/jmri/server/json/util/node-client.json
[CucumberReport] /var/lib/jenkins/jobs/Development/jobs/Cucumber/builds/1/cucumber-html-reports/.cache/target/classes/jmri/server/json/util/node-server.json
[CucumberReport] /var/lib/jenkins/jobs/Development/jobs/Cucumber/builds/1/cucumber-html-reports/.cache/target/classes/jmri/server/json/util/panel-client.json
[CucumberReport] /var/lib/jenkins/jobs/Development/jobs/Cucumber/builds/1/cucumber-html-reports/.cache/target/classes/jmri/server/json/util/panel-server.json
[CucumberReport] /var/lib/jenkins/jobs/Development/jobs/Cucumber/builds/1/cucumber-html-reports/.cache/target/classes/jmri/server/json/util/ping-client.json
[CucumberReport] /var/lib/jenkins/jobs/Development/jobs/Cucumber/builds/1/cucumber-html-reports/.cache/target/classes/jmri/server/json/util/pong-server.json
[CucumberReport] /var/lib/jenkins/jobs/Development/jobs/Cucumber/builds/1/cucumber-html-reports/.cache/target/classes/jmri/server/json/util/railroad-client.json
[CucumberReport] /var/lib/jenkins/jobs/Development/jobs/Cucumber/builds/1/cucumber-html-reports/.cache/target/classes/jmri/server/json/util/railroad-server.json
[CucumberReport] /var/lib/jenkins/jobs/Development/jobs/Cucumber/builds/1/cucumber-html-reports/.cache/target/classes/jmri/server/json/util/systemConnection-client.json
[CucumberReport] /var/lib/jenkins/jobs/Development/jobs/Cucumber/builds/1/cucumber-html-reports/.cache/target/classes/jmri/server/json/util/systemConnection-server.json
[CucumberReport] /var/lib/jenkins/jobs/Development/jobs/Cucumber/builds/1/cucumber-html-reports/.cache/web/app/app/locale-de.json
[CucumberReport] /var/lib/jenkins/jobs/Development/jobs/Cucumber/builds/1/cucumber-html-reports/.cache/web/app/app/locale-en.json
[CucumberReport] /var/lib/jenkins/jobs/Development/jobs/Cucumber/builds/1/cucumber-html-reports/.cache/web/app/app/locale-nl.json
[CucumberReport] /var/lib/jenkins/jobs/Development/jobs/Cucumber/builds/1/cucumber-html-reports/.cache/web/app/app/manifest.json
[CucumberReport] /var/lib/jenkins/jobs/Development/jobs/Cucumber/builds/1/cucumber-html-reports/.cache/web/app/app/navigation-de.json
[CucumberReport] /var/lib/jenkins/jobs/Development/jobs/Cucumber/builds/1/cucumber-html-reports/.cache/web/app/app/navigation-en.json
[CucumberReport] /var/lib/jenkins/jobs/Development/jobs/Cucumber/builds/1/cucumber-html-reports/.cache/web/app/app/navigation-nl.json
[CucumberReport] /var/lib/jenkins/jobs/Development/jobs/Cucumber/builds/1/cucumber-html-reports/.cache/web/app/node_modules/@types/c3/package.json
[CucumberReport] /var/lib/jenkins/jobs/Development/jobs/Cucumber/builds/1/cucumber-html-reports/.cache/web/app/node_modules/@types/d3-array/package.json
[CucumberReport] /var/lib/jenkins/jobs/Development/jobs/Cucumber/builds/1/cucumber-html-reports/.cache/web/app/node_modules/@types/d3-axis/package.json
[CucumberReport] /var/lib/jenkins/jobs/Development/jobs/Cucumber/builds/1/cucumber-html-reports/.cache/web/app/node_modules/@types/d3-brush/package.json
[CucumberReport] /var/lib/jenkins/jobs/Development/jobs/Cucumber/builds/1/cucumber-html-reports/.cache/web/app/node_modules/@types/d3-chord/package.json
[CucumberReport] /var/lib/jenkins/jobs/Development/jobs/Cucumber/builds/1/cucumber-html-reports/.cache/web/app/node_modules/@types/d3-collection/package.json
[CucumberReport] /var/lib/jenkins/jobs/Development/jobs/Cucumber/builds/1/cucumber-html-reports/.cache/web/app/node_modules/@types/d3-color/package.json
[CucumberReport] /var/lib/jenkins/jobs/Development/jobs/Cucumber/builds/1/cucumber-html-reports/.cache/web/app/node_modules/@types/d3-dispatch/package.json
[CucumberReport] /var/lib/jenkins/jobs/Development/jobs/Cucumber/builds/1/cucumber-html-reports/.cache/web/app/node_modules/@types/d3-drag/package.json
[CucumberReport] /var/lib/jenkins/jobs/Development/jobs/Cucumber/builds/1/cucumber-html-reports/.cache/web/app/node_modules/@types/d3-dsv/package.json
[CucumberReport] /var/lib/jenkins/jobs/Development/jobs/Cucumber/builds/1/cucumber-html-reports/.cache/web/app/node_modules/@types/d3-ease/package.json
[CucumberReport] /var/lib/jenkins/jobs/Development/jobs/Cucumber/builds/1/cucumber-html-reports/.cache/web/app/node_modules/@types/d3-force/package.json
[CucumberReport] /var/lib/jenkins/jobs/Development/jobs/Cucumber/builds/1/cucumber-html-reports/.cache/web/app/node_modules/@types/d3-format/package.json
[CucumberReport] /var/lib/jenkins/jobs/Development/jobs/Cucumber/builds/1/cucumber-html-reports/.cache/web/app/node_modules/@types/d3-geo/package.json
[CucumberReport] /var/lib/jenkins/jobs/Development/jobs/Cucumber/builds/1/cucumber-html-reports/.cache/web/app/node_modules/@types/d3-hierarchy/package.json
[CucumberReport] /var/lib/jenkins/jobs/Development/jobs/Cucumber/builds/1/cucumber-html-reports/.cache/web/app/node_modules/@types/d3-interpolate/package.json
[CucumberReport] /var/lib/jenkins/jobs/Development/jobs/Cucumber/builds/1/cucumber-html-reports/.cache/web/app/node_modules/@types/d3-path/package.json
[CucumberReport] /var/lib/jenkins/jobs/Development/jobs/Cucumber/builds/1/cucumber-html-reports/.cache/web/app/node_modules/@types/d3-polygon/package.json
[CucumberReport] /var/lib/jenkins/jobs/Development/jobs/Cucumber/builds/1/cucumber-html-reports/.cache/web/app/node_modules/@types/d3-quadtree/package.json
[CucumberReport] /var/lib/jenkins/jobs/Development/jobs/Cucumber/builds/1/cucumber-html-reports/.cache/web/app/node_modules/@types/d3-queue/package.json
[CucumberReport] /var/lib/jenkins/jobs/Development/jobs/Cucumber/builds/1/cucumber-html-reports/.cache/web/app/node_modules/@types/d3-random/package.json
[CucumberReport] /var/lib/jenkins/jobs/Development/jobs/Cucumber/builds/1/cucumber-html-reports/.cache/web/app/node_modules/@types/d3-request/package.json
[CucumberReport] /var/lib/jenkins/jobs/Development/jobs/Cucumber/builds/1/cucumber-html-reports/.cache/web/app/node_modules/@types/d3-scale/package.json
[CucumberReport] /var/lib/jenkins/jobs/Development/jobs/Cucumber/builds/1/cucumber-html-reports/.cache/web/app/node_modules/@types/d3-selection/package.json
[CucumberReport] /var/lib/jenkins/jobs/Development/jobs/Cucumber/builds/1/cucumber-html-reports/.cache/web/app/node_modules/@types/d3-shape/package.json
[CucumberReport] /var/lib/jenkins/jobs/Development/jobs/Cucumber/builds/1/cucumber-html-reports/.cache/web/app/node_modules/@types/d3-time-format/package.json
[CucumberReport] /var/lib/jenkins/jobs/Development/jobs/Cucumber/builds/1/cucumber-html-reports/.cache/web/app/node_modules/@types/d3-time/package.json
[CucumberReport] /var/lib/jenkins/jobs/Development/jobs/Cucumber/builds/1/cucumber-html-reports/.cache/web/app/node_modules/@types/d3-timer/package.json
[CucumberReport] /var/lib/jenkins/jobs/Development/jobs/Cucumber/builds/1/cucumber-html-reports/.cache/web/app/node_modules/@types/d3-transition/package.json
[CucumberReport] /var/lib/jenkins/jobs/Development/jobs/Cucumber/builds/1/cucumber-html-reports/.cache/web/app/node_modules/@types/d3-voronoi/package.json
[CucumberReport] /var/lib/jenkins/jobs/Development/jobs/Cucumber/builds/1/cucumber-html-reports/.cache/web/app/node_modules/@types/d3-zoom/package.json
[CucumberReport] /var/lib/jenkins/jobs/Development/jobs/Cucumber/builds/1/cucumber-html-reports/.cache/web/app/node_modules/@types/d3/package.json
[CucumberReport] /var/lib/jenkins/jobs/Development/jobs/Cucumber/builds/1/cucumber-html-reports/.cache/web/app/node_modules/@types/geojson/package.json
[CucumberReport] /var/lib/jenkins/jobs/Development/jobs/Cucumber/builds/1/cucumber-html-reports/.cache/web/app/node_modules/abbrev/package.json
[CucumberReport] /var/lib/jenkins/jobs/Development/jobs/Cucumber/builds/1/cucumber-html-reports/.cache/web/app/node_modules/ajv/lib/refs/data.json
[CucumberReport] /var/lib/jenkins/jobs/Development/jobs/Cucumber/builds/1/cucumber-html-reports/.cache/web/app/node_modules/ajv/lib/refs/json-schema-draft-04.json
[CucumberReport] /var/lib/jenkins/jobs/Development/jobs/Cucumber/builds/1/cucumber-html-reports/.cache/web/app/node_modules/ajv/lib/refs/json-schema-draft-06.json
[CucumberReport] /var/lib/jenkins/jobs/Development/jobs/Cucumber/builds/1/cucumber-html-reports/.cache/web/app/node_modules/ajv/lib/refs/json-schema-draft-07.json
[CucumberReport] /var/lib/jenkins/jobs/Development/jobs/Cucumber/builds/1/cucumber-html-reports/.cache/web/app/node_modules/ajv/lib/refs/json-schema-secure.json
[CucumberReport] /var/lib/jenkins/jobs/Development/jobs/Cucumber/builds/1/cucumber-html-reports/.cache/web/app/node_modules/ajv/package.json
[CucumberReport] /var/lib/jenkins/jobs/Development/jobs/Cucumber/builds/1/cucumber-html-reports/.cache/web/app/node_modules/amdefine/package.json
[CucumberReport] /var/lib/jenkins/jobs/Development/jobs/Cucumber/builds/1/cucumber-html-reports/.cache/web/app/node_modules/angular-animate/bower.json
[CucumberReport] /var/lib/jenkins/jobs/Development/jobs/Cucumber/builds/1/cucumber-html-reports/.cache/web/app/node_modules/angular-animate/package.json
[CucumberReport] /var/lib/jenkins/jobs/Development/jobs/Cucumber/builds/1/cucumber-html-reports/.cache/web/app/node_modules/angular-drag-and-drop-lists/bower.json
[CucumberReport] /var/lib/jenkins/jobs/Development/jobs/Cucumber/builds/1/cucumber-html-reports/.cache/web/app/node_modules/angular-drag-and-drop-lists/package.json
[CucumberReport] /var/lib/jenkins/jobs/Development/jobs/Cucumber/builds/1/cucumber-html-reports/.cache/web/app/node_modules/angular-patternfly/node_modules/bootstrap/grunt/configBridge.json
[CucumberReport] /var/lib/jenkins/jobs/Development/jobs/Cucumber/builds/1/cucumber-html-reports/.cache/web/app/node_modules/angular-patternfly/node_modules/bootstrap/grunt/npm-shrinkwrap.json
[CucumberReport] /var/lib/jenkins/jobs/Development/jobs/Cucumber/builds/1/cucumber-html-reports/.cache/web/app/node_modules/angular-patternfly/node_modules/bootstrap/package.json
[CucumberReport] /var/lib/jenkins/jobs/Development/jobs/Cucumber/builds/1/cucumber-html-reports/.cache/web/app/node_modules/angular-patternfly/node_modules/moment/package.json
[CucumberReport] /var/lib/jenkins/jobs/Development/jobs/Cucumber/builds/1/cucumber-html-reports/.cache/web/app/node_modules/angular-patternfly/package.json
[CucumberReport] /var/lib/jenkins/jobs/Development/jobs/Cucumber/builds/1/cucumber-html-reports/.cache/web/app/node_modules/angular-resource/bower.json
[CucumberReport] /var/lib/jenkins/jobs/Development/jobs/Cucumber/builds/1/cucumber-html-reports/.cache/web/app/node_modules/angular-resource/package.json
[CucumberReport] /var/lib/jenkins/jobs/Development/jobs/Cucumber/builds/1/cucumber-html-reports/.cache/web/app/node_modules/angular-route/bower.json
[CucumberReport] /var/lib/jenkins/jobs/Development/jobs/Cucumber/builds/1/cucumber-html-reports/.cache/web/app/node_modules/angular-route/package.json
[CucumberReport] /var/lib/jenkins/jobs/Development/jobs/Cucumber/builds/1/cucumber-html-reports/.cache/web/app/node_modules/angular-sanitize/bower.json
[CucumberReport] /var/lib/jenkins/jobs/Development/jobs/Cucumber/builds/1/cucumber-html-reports/.cache/web/app/node_modules/angular-sanitize/package.json
[CucumberReport] /var/lib/jenkins/jobs/Development/jobs/Cucumber/builds/1/cucumber-html-reports/.cache/web/app/node_modules/angular-svg-base-fix/bower.json
[CucumberReport] /var/lib/jenkins/jobs/Development/jobs/Cucumber/builds/1/cucumber-html-reports/.cache/web/app/node_modules/angular-svg-base-fix/package.json
[CucumberReport] /var/lib/jenkins/jobs/Development/jobs/Cucumber/builds/1/cucumber-html-reports/.cache/web/app/node_modules/angular-translate-handler-log/bower.json
[CucumberReport] /var/lib/jenkins/jobs/Development/jobs/Cucumber/builds/1/cucumber-html-reports/.cache/web/app/node_modules/angular-translate-handler-log/package.json
[CucumberReport] /var/lib/jenkins/jobs/Development/jobs/Cucumber/builds/1/cucumber-html-reports/.cache/web/app/node_modules/angular-translate-loader-partial/bower.json
[CucumberReport] /var/lib/jenkins/jobs/Development/jobs/Cucumber/builds/1/cucumber-html-reports/.cache/web/app/node_modules/angular-translate-loader-partial/package.json
[CucumberReport] /var/lib/jenkins/jobs/Development/jobs/Cucumber/builds/1/cucumber-html-reports/.cache/web/app/node_modules/angular-translate/package.json
[CucumberReport] /var/lib/jenkins/jobs/Development/jobs/Cucumber/builds/1/cucumber-html-reports/.cache/web/app/node_modules/angular-ui-bootstrap/package.json
[CucumberReport] /var/lib/jenkins/jobs/Development/jobs/Cucumber/builds/1/cucumber-html-reports/.cache/web/app/node_modules/angular-websocket/package.json
[CucumberReport] /var/lib/jenkins/jobs/Development/jobs/Cucumber/builds/1/cucumber-html-reports/.cache/web/app/node_modules/angular/bower.json
[CucumberReport] /var/lib/jenkins/jobs/Development/jobs/Cucumber/builds/1/cucumber-html-reports/.cache/web/app/node_modules/angular/package.json
[CucumberReport] /var/lib/jenkins/jobs/Development/jobs/Cucumber/builds/1/cucumber-html-reports/.cache/web/app/node_modules/angularjs-datatables/archives/v0.2.x/data.json
[CucumberReport] /var/lib/jenkins/jobs/Development/jobs/Cucumber/builds/1/cucumber-html-reports/.cache/web/app/node_modules/angularjs-datatables/archives/v0.2.x/data1.json
[CucumberReport] /var/lib/jenkins/jobs/Development/jobs/Cucumber/builds/1/cucumber-html-reports/.cache/web/app/node_modules/angularjs-datatables/archives/v0.3.x/data.json
[CucumberReport] /var/lib/jenkins/jobs/Development/jobs/Cucumber/builds/1/cucumber-html-reports/.cache/web/app/node_modules/angularjs-datatables/archives/v0.3.x/data1.json
[CucumberReport] /var/lib/jenkins/jobs/Development/jobs/Cucumber/builds/1/cucumber-html-reports/.cache/web/app/node_modules/angularjs-datatables/archives/v0.4.x/data.json
[CucumberReport] /var/lib/jenkins/jobs/Development/jobs/Cucumber/builds/1/cucumber-html-reports/.cache/web/app/node_modules/angularjs-datatables/archives/v0.4.x/data1.json
[CucumberReport] /var/lib/jenkins/jobs/Development/jobs/Cucumber/builds/1/cucumber-html-reports/.cache/web/app/node_modules/angularjs-datatables/bower.json
[CucumberReport] /var/lib/jenkins/jobs/Development/jobs/Cucumber/builds/1/cucumber-html-reports/.cache/web/app/node_modules/angularjs-datatables/data.json
[CucumberReport] /var/lib/jenkins/jobs/Development/jobs/Cucumber/builds/1/cucumber-html-reports/.cache/web/app/node_modules/angularjs-datatables/data1.json
[CucumberReport] /var/lib/jenkins/jobs/Development/jobs/Cucumber/builds/1/cucumber-html-reports/.cache/web/app/node_modules/angularjs-datatables/dtColumns.json
[CucumberReport] /var/lib/jenkins/jobs/Development/jobs/Cucumber/builds/1/cucumber-html-reports/.cache/web/app/node_modules/angularjs-datatables/dtOptions.json
[CucumberReport] /var/lib/jenkins/jobs/Development/jobs/Cucumber/builds/1/cucumber-html-reports/.cache/web/app/node_modules/angularjs-datatables/package.json
[CucumberReport] /var/lib/jenkins/jobs/Development/jobs/Cucumber/builds/1/cucumber-html-reports/.cache/web/app/node_modules/angularjs-datatables/vendor/angular-bootstrap/.bower.json
[CucumberReport] /var/lib/jenkins/jobs/Development/jobs/Cucumber/builds/1/cucumber-html-reports/.cache/web/app/node_modules/angularjs-datatables/vendor/angular-bootstrap/bower.json
[CucumberReport] /var/lib/jenkins/jobs/Development/jobs/Cucumber/builds/1/cucumber-html-reports/.cache/web/app/node_modules/angularjs-datatables/vendor/angular-highlightjs/.bower.json
[CucumberReport] /var/lib/jenkins/jobs/Development/jobs/Cucumber/builds/1/cucumber-html-reports/.cache/web/app/node_modules/angularjs-datatables/vendor/angular-highlightjs/bower.json
[CucumberReport] /var/lib/jenkins/jobs/Development/jobs/Cucumber/builds/1/cucumber-html-reports/.cache/web/app/node_modules/angularjs-datatables/vendor/angular-mocks/.bower.json
[CucumberReport] /var/lib/jenkins/jobs/Development/jobs/Cucumber/builds/1/cucumber-html-reports/.cache/web/app/node_modules/angularjs-datatables/vendor/angular-mocks/bower.json
[CucumberReport] /var/lib/jenkins/jobs/Development/jobs/Cucumber/builds/1/cucumber-html-reports/.cache/web/app/node_modules/angularjs-datatables/vendor/angular-mocks/package.json
[CucumberReport] /var/lib/jenkins/jobs/Development/jobs/Cucumber/builds/1/cucumber-html-reports/.cache/web/app/node_modules/angularjs-datatables/vendor/angular-resource/.bower.json
[CucumberReport] /var/lib/jenkins/jobs/Development/jobs/Cucumber/builds/1/cucumber-html-reports/.cache/web/app/node_modules/angularjs-datatables/vendor/angular-resource/bower.json
[CucumberReport] /var/lib/jenkins/jobs/Development/jobs/Cucumber/builds/1/cucumber-html-reports/.cache/web/app/node_modules/angularjs-datatables/vendor/angular-resource/package.json
[CucumberReport] /var/lib/jenkins/jobs/Development/jobs/Cucumber/builds/1/cucumber-html-reports/.cache/web/app/node_modules/angularjs-datatables/vendor/angular-translate/.bower.json
[CucumberReport] /var/lib/jenkins/jobs/Development/jobs/Cucumber/builds/1/cucumber-html-reports/.cache/web/app/node_modules/angularjs-datatables/vendor/angular-translate/bower.json
[CucumberReport] /var/lib/jenkins/jobs/Development/jobs/Cucumber/builds/1/cucumber-html-reports/.cache/web/app/node_modules/angularjs-datatables/vendor/angular-ui-router/.bower.json
[CucumberReport] /var/lib/jenkins/jobs/Development/jobs/Cucumber/builds/1/cucumber-html-reports/.cache/web/app/node_modules/angularjs-datatables/vendor/angular-ui-router/bower.json
[CucumberReport] /var/lib/jenkins/jobs/Development/jobs/Cucumber/builds/1/cucumber-html-reports/.cache/web/app/node_modules/angularjs-datatables/vendor/angular/.bower.json
[CucumberReport] /var/lib/jenkins/jobs/Development/jobs/Cucumber/builds/1/cucumber-html-reports/.cache/web/app/node_modules/angularjs-datatables/vendor/angular/bower.json
[CucumberReport] /var/lib/jenkins/jobs/Development/jobs/Cucumber/builds/1/cucumber-html-reports/.cache/web/app/node_modules/angularjs-datatables/vendor/angular/package.json
[CucumberReport] /var/lib/jenkins/jobs/Development/jobs/Cucumber/builds/1/cucumber-html-reports/.cache/web/app/node_modules/angularjs-datatables/vendor/bootstrap/.bower.json
[CucumberReport] /var/lib/jenkins/jobs/Development/jobs/Cucumber/builds/1/cucumber-html-reports/.cache/web/app/node_modules/angularjs-datatables/vendor/bootstrap/bower.json
[CucumberReport] /var/lib/jenkins/jobs/Development/jobs/Cucumber/builds/1/cucumber-html-reports/.cache/web/app/node_modules/angularjs-datatables/vendor/bootstrap/grunt/configBridge.json
[CucumberReport] /var/lib/jenkins/jobs/Development/jobs/Cucumber/builds/1/cucumber-html-reports/.cache/web/app/node_modules/angularjs-datatables/vendor/bootstrap/less/.csscomb.json
[CucumberReport] /var/lib/jenkins/jobs/Development/jobs/Cucumber/builds/1/cucumber-html-reports/.cache/web/app/node_modules/angularjs-datatables/vendor/bootstrap/package.json
[CucumberReport] /var/lib/jenkins/jobs/Development/jobs/Cucumber/builds/1/cucumber-html-reports/.cache/web/app/node_modules/angularjs-datatables/vendor/datatables-buttons/.bower.json
[CucumberReport] /var/lib/jenkins/jobs/Development/jobs/Cucumber/builds/1/cucumber-html-reports/.cache/web/app/node_modules/angularjs-datatables/vendor/datatables-buttons/bower.json
[CucumberReport] /var/lib/jenkins/jobs/Development/jobs/Cucumber/builds/1/cucumber-html-reports/.cache/web/app/node_modules/angularjs-datatables/vendor/datatables-colreorder/.bower.json
[CucumberReport] /var/lib/jenkins/jobs/Development/jobs/Cucumber/builds/1/cucumber-html-reports/.cache/web/app/node_modules/angularjs-datatables/vendor/datatables-colreorder/bower.json
[CucumberReport] /var/lib/jenkins/jobs/Development/jobs/Cucumber/builds/1/cucumber-html-reports/.cache/web/app/node_modules/angularjs-datatables/vendor/datatables-colvis/.bower.json
[CucumberReport] /var/lib/jenkins/jobs/Development/jobs/Cucumber/builds/1/cucumber-html-reports/.cache/web/app/node_modules/angularjs-datatables/vendor/datatables-colvis/bower.json
[CucumberReport] /var/lib/jenkins/jobs/Development/jobs/Cucumber/builds/1/cucumber-html-reports/.cache/web/app/node_modules/angularjs-datatables/vendor/datatables-fixedcolumns/.bower.json
[CucumberReport] /var/lib/jenkins/jobs/Development/jobs/Cucumber/builds/1/cucumber-html-reports/.cache/web/app/node_modules/angularjs-datatables/vendor/datatables-fixedcolumns/bower.json
[CucumberReport] /var/lib/jenkins/jobs/Development/jobs/Cucumber/builds/1/cucumber-html-reports/.cache/web/app/node_modules/angularjs-datatables/vendor/datatables-fixedheader/.bower.json
[CucumberReport] /var/lib/jenkins/jobs/Development/jobs/Cucumber/builds/1/cucumber-html-reports/.cache/web/app/node_modules/angularjs-datatables/vendor/datatables-fixedheader/bower.json
[CucumberReport] /var/lib/jenkins/jobs/Development/jobs/Cucumber/builds/1/cucumber-html-reports/.cache/web/app/node_modules/angularjs-datatables/vendor/datatables-light-columnfilter/.bower.json
[CucumberReport] /var/lib/jenkins/jobs/Development/jobs/Cucumber/builds/1/cucumber-html-reports/.cache/web/app/node_modules/angularjs-datatables/vendor/datatables-light-columnfilter/bower.json
[CucumberReport] /var/lib/jenkins/jobs/Development/jobs/Cucumber/builds/1/cucumber-html-reports/.cache/web/app/node_modules/angularjs-datatables/vendor/datatables-responsive/.bower.json
[CucumberReport] /var/lib/jenkins/jobs/Development/jobs/Cucumber/builds/1/cucumber-html-reports/.cache/web/app/node_modules/angularjs-datatables/vendor/datatables-responsive/bower.json
[CucumberReport] /var/lib/jenkins/jobs/Development/jobs/Cucumber/builds/1/cucumber-html-reports/.cache/web/app/node_modules/angularjs-datatables/vendor/datatables-scroller/.bower.json
[CucumberReport] /var/lib/jenkins/jobs/Development/jobs/Cucumber/builds/1/cucumber-html-reports/.cache/web/app/node_modules/angularjs-datatables/vendor/datatables-scroller/bower.json
[CucumberReport] /var/lib/jenkins/jobs/Development/jobs/Cucumber/builds/1/cucumber-html-reports/.cache/web/app/node_modules/angularjs-datatables/vendor/datatables-select/bower.json
[CucumberReport] /var/lib/jenkins/jobs/Development/jobs/Cucumber/builds/1/cucumber-html-reports/.cache/web/app/node_modules/angularjs-datatables/vendor/datatables-tabletools/.bower.json
[CucumberReport] /var/lib/jenkins/jobs/Development/jobs/Cucumber/builds/1/cucumber-html-reports/.cache/web/app/node_modules/angularjs-datatables/vendor/datatables-tabletools/bower.json
[CucumberReport] /var/lib/jenkins/jobs/Development/jobs/Cucumber/builds/1/cucumber-html-reports/.cache/web/app/node_modules/angularjs-datatables/vendor/datatables/.bower.json
[CucumberReport] /var/lib/jenkins/jobs/Development/jobs/Cucumber/builds/1/cucumber-html-reports/.cache/web/app/node_modules/angularjs-datatables/vendor/datatables/bower.json
[CucumberReport] /var/lib/jenkins/jobs/Development/jobs/Cucumber/builds/1/cucumber-html-reports/.cache/web/app/node_modules/angularjs-datatables/vendor/font-awesome-animation/.bower.json
[CucumberReport] /var/lib/jenkins/jobs/Development/jobs/Cucumber/builds/1/cucumber-html-reports/.cache/web/app/node_modules/angularjs-datatables/vendor/font-awesome-animation/bower.json
[CucumberReport] /var/lib/jenkins/jobs/Development/jobs/Cucumber/builds/1/cucumber-html-reports/.cache/web/app/node_modules/angularjs-datatables/vendor/font-awesome-animation/package.json
[CucumberReport] /var/lib/jenkins/jobs/Development/jobs/Cucumber/builds/1/cucumber-html-reports/.cache/web/app/node_modules/angularjs-datatables/vendor/highlightjs/.bower.json
[CucumberReport] /var/lib/jenkins/jobs/Development/jobs/Cucumber/builds/1/cucumber-html-reports/.cache/web/app/node_modules/angularjs-datatables/vendor/highlightjs/bower.json
[CucumberReport] /var/lib/jenkins/jobs/Development/jobs/Cucumber/builds/1/cucumber-html-reports/.cache/web/app/node_modules/angularjs-datatables/vendor/highlightjs/component.json
[CucumberReport] /var/lib/jenkins/jobs/Development/jobs/Cucumber/builds/1/cucumber-html-reports/.cache/web/app/node_modules/angularjs-datatables/vendor/highlightjs/composer.json
[CucumberReport] /var/lib/jenkins/jobs/Development/jobs/Cucumber/builds/1/cucumber-html-reports/.cache/web/app/node_modules/angularjs-datatables/vendor/jquery/.bower.json
[CucumberReport] /var/lib/jenkins/jobs/Development/jobs/Cucumber/builds/1/cucumber-html-reports/.cache/web/app/node_modules/angularjs-datatables/vendor/jquery/bower.json
[CucumberReport] /var/lib/jenkins/jobs/Development/jobs/Cucumber/builds/1/cucumber-html-reports/.cache/web/app/node_modules/ansi-regex/package.json
[CucumberReport] /var/lib/jenkins/jobs/Development/jobs/Cucumber/builds/1/cucumber-html-reports/.cache/web/app/node_modules/ansi-styles/package.json
[CucumberReport] /var/lib/jenkins/jobs/Development/jobs/Cucumber/builds/1/cucumber-html-reports/.cache/web/app/node_modules/aproba/package.json
[CucumberReport] /var/lib/jenkins/jobs/Development/jobs/Cucumber/builds/1/cucumber-html-reports/.cache/web/app/node_modules/are-we-there-yet/package.json
[CucumberReport] /var/lib/jenkins/jobs/Development/jobs/Cucumber/builds/1/cucumber-html-reports/.cache/web/app/node_modules/array-find-index/package.json
[CucumberReport] /var/lib/jenkins/jobs/Development/jobs/Cucumber/builds/1/cucumber-html-reports/.cache/web/app/node_modules/asn1/package.json
[CucumberReport] /var/lib/jenkins/jobs/Development/jobs/Cucumber/builds/1/cucumber-html-reports/.cache/web/app/node_modules/assert-plus/package.json
[CucumberReport] /var/lib/jenkins/jobs/Development/jobs/Cucumber/builds/1/cucumber-html-reports/.cache/web/app/node_modules/async-foreach/package.json
[CucumberReport] /var/lib/jenkins/jobs/Development/jobs/Cucumber/builds/1/cucumber-html-reports/.cache/web/app/node_modules/asynckit/package.json
[CucumberReport] /var/lib/jenkins/jobs/Development/jobs/Cucumber/builds/1/cucumber-html-reports/.cache/web/app/node_modules/aws-sign2/package.json
[CucumberReport] /var/lib/jenkins/jobs/Development/jobs/Cucumber/builds/1/cucumber-html-reports/.cache/web/app/node_modules/aws4/package.json
[CucumberReport] /var/lib/jenkins/jobs/Development/jobs/Cucumber/builds/1/cucumber-html-reports/.cache/web/app/node_modules/balanced-match/package.json
[CucumberReport] /var/lib/jenkins/jobs/Development/jobs/Cucumber/builds/1/cucumber-html-reports/.cache/web/app/node_modules/bcrypt-pbkdf/package.json
[CucumberReport] /var/lib/jenkins/jobs/Development/jobs/Cucumber/builds/1/cucumber-html-reports/.cache/web/app/node_modules/block-stream/package.json
[CucumberReport] /var/lib/jenkins/jobs/Development/jobs/Cucumber/builds/1/cucumber-html-reports/.cache/web/app/node_modules/bootstrap-datepicker/package.json
[CucumberReport] /var/lib/jenkins/jobs/Development/jobs/Cucumber/builds/1/cucumber-html-reports/.cache/web/app/node_modules/bootstrap-sass/package.json
[CucumberReport] /var/lib/jenkins/jobs/Development/jobs/Cucumber/builds/1/cucumber-html-reports/.cache/web/app/node_modules/bootstrap-select/bower.json
[CucumberReport] /var/lib/jenkins/jobs/Development/jobs/Cucumber/builds/1/cucumber-html-reports/.cache/web/app/node_modules/bootstrap-select/composer.json
[CucumberReport] /var/lib/jenkins/jobs/Development/jobs/Cucumber/builds/1/cucumber-html-reports/.cache/web/app/node_modules/bootstrap-select/package.json
[CucumberReport] /var/lib/jenkins/jobs/Development/jobs/Cucumber/builds/1/cucumber-html-reports/.cache/web/app/node_modules/bootstrap-slider/bower.json
[CucumberReport] /var/lib/jenkins/jobs/Development/jobs/Cucumber/builds/1/cucumber-html-reports/.cache/web/app/node_modules/bootstrap-slider/composer.json
[CucumberReport] /var/lib/jenkins/jobs/Development/jobs/Cucumber/builds/1/cucumber-html-reports/.cache/web/app/node_modules/bootstrap-slider/package-lock.json
[CucumberReport] /var/lib/jenkins/jobs/Development/jobs/Cucumber/builds/1/cucumber-html-reports/.cache/web/app/node_modules/bootstrap-slider/package.json
[CucumberReport] /var/lib/jenkins/jobs/Development/jobs/Cucumber/builds/1/cucumber-html-reports/.cache/web/app/node_modules/bootstrap-switch/bower.json
[CucumberReport] /var/lib/jenkins/jobs/Development/jobs/Cucumber/builds/1/cucumber-html-reports/.cache/web/app/node_modules/bootstrap-switch/composer.json
[CucumberReport] /var/lib/jenkins/jobs/Development/jobs/Cucumber/builds/1/cucumber-html-reports/.cache/web/app/node_modules/bootstrap-switch/package.json
[CucumberReport] /var/lib/jenkins/jobs/Development/jobs/Cucumber/builds/1/cucumber-html-reports/.cache/web/app/node_modules/bootstrap-switch/src/docs/harp.json
[CucumberReport] /var/lib/jenkins/jobs/Development/jobs/Cucumber/builds/1/cucumber-html-reports/.cache/web/app/node_modules/bootstrap-touchspin/bootstrap-touchspin.jquery.json
[CucumberReport] /var/lib/jenkins/jobs/Development/jobs/Cucumber/builds/1/cucumber-html-reports/.cache/web/app/node_modules/bootstrap-touchspin/bower.json
[CucumberReport] /var/lib/jenkins/jobs/Development/jobs/Cucumber/builds/1/cucumber-html-reports/.cache/web/app/node_modules/bootstrap-touchspin/package.json
[CucumberReport] /var/lib/jenkins/jobs/Development/jobs/Cucumber/builds/1/cucumber-html-reports/.cache/web/app/node_modules/bootstrap/grunt/configBridge.json
[CucumberReport] /var/lib/jenkins/jobs/Development/jobs/Cucumber/builds/1/cucumber-html-reports/.cache/web/app/node_modules/bootstrap/package.json
[CucumberReport] /var/lib/jenkins/jobs/Development/jobs/Cucumber/builds/1/cucumber-html-reports/.cache/web/app/node_modules/brace-expansion/package.json
[CucumberReport] /var/lib/jenkins/jobs/Development/jobs/Cucumber/builds/1/cucumber-html-reports/.cache/web/app/node_modules/c3/bower.json
[CucumberReport] /var/lib/jenkins/jobs/Development/jobs/Cucumber/builds/1/cucumber-html-reports/.cache/web/app/node_modules/c3/component.json
[CucumberReport] /var/lib/jenkins/jobs/Development/jobs/Cucumber/builds/1/cucumber-html-reports/.cache/web/app/node_modules/c3/extensions/exporter/config.json
[CucumberReport] /var/lib/jenkins/jobs/Development/jobs/Cucumber/builds/1/cucumber-html-reports/.cache/web/app/node_modules/c3/htdocs/data/c3_test.json
[CucumberReport] /var/lib/jenkins/jobs/Development/jobs/Cucumber/builds/1/cucumber-html-reports/.cache/web/app/node_modules/c3/htdocs/data/c3_test_2.json
[CucumberReport] /var/lib/jenkins/jobs/Development/jobs/Cucumber/builds/1/cucumber-html-reports/.cache/web/app/node_modules/c3/htdocs/data/c3_test_3.json
[CucumberReport] /var/lib/jenkins/jobs/Development/jobs/Cucumber/builds/1/cucumber-html-reports/.cache/web/app/node_modules/c3/package.json
[CucumberReport] /var/lib/jenkins/jobs/Development/jobs/Cucumber/builds/1/cucumber-html-reports/.cache/web/app/node_modules/camelcase-keys/package.json
[CucumberReport] /var/lib/jenkins/jobs/Development/jobs/Cucumber/builds/1/cucumber-html-reports/.cache/web/app/node_modules/camelcase/package.json
[CucumberReport] /var/lib/jenkins/jobs/Development/jobs/Cucumber/builds/1/cucumber-html-reports/.cache/web/app/node_modules/caseless/package.json
[CucumberReport] /var/lib/jenkins/jobs/Development/jobs/Cucumber/builds/1/cucumber-html-reports/.cache/web/app/node_modules/chalk/package.json
[CucumberReport] /var/lib/jenkins/jobs/Development/jobs/Cucumber/builds/1/cucumber-html-reports/.cache/web/app/node_modules/cliui/package.json
[CucumberReport] /var/lib/jenkins/jobs/Development/jobs/Cucumber/builds/1/cucumber-html-reports/.cache/web/app/node_modules/code-point-at/package.json
[CucumberReport] /var/lib/jenkins/jobs/Development/jobs/Cucumber/builds/1/cucumber-html-reports/.cache/web/app/node_modules/combined-stream/package.json
[CucumberReport] /var/lib/jenkins/jobs/Development/jobs/Cucumber/builds/1/cucumber-html-reports/.cache/web/app/node_modules/concat-map/package.json
[CucumberReport] /var/lib/jenkins/jobs/Development/jobs/Cucumber/builds/1/cucumber-html-reports/.cache/web/app/node_modules/console-control-strings/package.json
[CucumberReport] /var/lib/jenkins/jobs/Development/jobs/Cucumber/builds/1/cucumber-html-reports/.cache/web/app/node_modules/core-util-is/package.json
[CucumberReport] /var/lib/jenkins/jobs/Development/jobs/Cucumber/builds/1/cucumber-html-reports/.cache/web/app/node_modules/cross-spawn/package.json
[CucumberReport] /var/lib/jenkins/jobs/Development/jobs/Cucumber/builds/1/cucumber-html-reports/.cache/web/app/node_modules/currently-unhandled/package.json
[CucumberReport] /var/lib/jenkins/jobs/Development/jobs/Cucumber/builds/1/cucumber-html-reports/.cache/web/app/node_modules/d3/composer.json
[CucumberReport] /var/lib/jenkins/jobs/Development/jobs/Cucumber/builds/1/cucumber-html-reports/.cache/web/app/node_modules/d3/package.json
[CucumberReport] /var/lib/jenkins/jobs/Development/jobs/Cucumber/builds/1/cucumber-html-reports/.cache/web/app/node_modules/dashdash/package.json
[CucumberReport] /var/lib/jenkins/jobs/Development/jobs/Cucumber/builds/1/cucumber-html-reports/.cache/web/app/node_modules/datatables.net-bs/node_modules/datatables.net/package.json
[CucumberReport] /var/lib/jenkins/jobs/Development/jobs/Cucumber/builds/1/cucumber-html-reports/.cache/web/app/node_modules/datatables.net-bs/package.json
[CucumberReport] /var/lib/jenkins/jobs/Development/jobs/Cucumber/builds/1/cucumber-html-reports/.cache/web/app/node_modules/datatables.net-colreorder-bs/package.json
[CucumberReport] /var/lib/jenkins/jobs/Development/jobs/Cucumber/builds/1/cucumber-html-reports/.cache/web/app/node_modules/datatables.net-colreorder/package.json
[CucumberReport] /var/lib/jenkins/jobs/Development/jobs/Cucumber/builds/1/cucumber-html-reports/.cache/web/app/node_modules/datatables.net-dt/package.json
[CucumberReport] /var/lib/jenkins/jobs/Development/jobs/Cucumber/builds/1/cucumber-html-reports/.cache/web/app/node_modules/datatables.net-select/package.json
[CucumberReport] /var/lib/jenkins/jobs/Development/jobs/Cucumber/builds/1/cucumber-html-reports/.cache/web/app/node_modules/datatables.net/package.json
[CucumberReport] /var/lib/jenkins/jobs/Development/jobs/Cucumber/builds/1/cucumber-html-reports/.cache/web/app/node_modules/decamelize/package.json
[CucumberReport] /var/lib/jenkins/jobs/Development/jobs/Cucumber/builds/1/cucumber-html-reports/.cache/web/app/node_modules/delayed-stream/package.json
[CucumberReport] /var/lib/jenkins/jobs/Development/jobs/Cucumber/builds/1/cucumber-html-reports/.cache/web/app/node_modules/delegates/package.json
[CucumberReport] /var/lib/jenkins/jobs/Development/jobs/Cucumber/builds/1/cucumber-html-reports/.cache/web/app/node_modules/drmonty-datatables-colvis/bower.json
[CucumberReport] /var/lib/jenkins/jobs/Development/jobs/Cucumber/builds/1/cucumber-html-reports/.cache/web/app/node_modules/drmonty-datatables-colvis/component.json
[CucumberReport] /var/lib/jenkins/jobs/Development/jobs/Cucumber/builds/1/cucumber-html-reports/.cache/web/app/node_modules/drmonty-datatables-colvis/composer.json
[CucumberReport] /var/lib/jenkins/jobs/Development/jobs/Cucumber/builds/1/cucumber-html-reports/.cache/web/app/node_modules/drmonty-datatables-colvis/package.json
[CucumberReport] /var/lib/jenkins/jobs/Development/jobs/Cucumber/builds/1/cucumber-html-reports/.cache/web/app/node_modules/ecc-jsbn/package.json
[CucumberReport] /var/lib/jenkins/jobs/Development/jobs/Cucumber/builds/1/cucumber-html-reports/.cache/web/app/node_modules/eonasdan-bootstrap-datetimepicker/.jscs.json
[CucumberReport] /var/lib/jenkins/jobs/Development/jobs/Cucumber/builds/1/cucumber-html-reports/.cache/web/app/node_modules/eonasdan-bootstrap-datetimepicker/.vs/VSWorkspaceState.json
[CucumberReport] /var/lib/jenkins/jobs/Development/jobs/Cucumber/builds/1/cucumber-html-reports/.cache/web/app/node_modules/eonasdan-bootstrap-datetimepicker/bower.json
[CucumberReport] /var/lib/jenkins/jobs/Development/jobs/Cucumber/builds/1/cucumber-html-reports/.cache/web/app/node_modules/eonasdan-bootstrap-datetimepicker/component.json
[CucumberReport] /var/lib/jenkins/jobs/Development/jobs/Cucumber/builds/1/cucumber-html-reports/.cache/web/app/node_modules/eonasdan-bootstrap-datetimepicker/composer.json
[CucumberReport] /var/lib/jenkins/jobs/Development/jobs/Cucumber/builds/1/cucumber-html-reports/.cache/web/app/node_modules/eonasdan-bootstrap-datetimepicker/docs/theme/manifest.json
[CucumberReport] /var/lib/jenkins/jobs/Development/jobs/Cucumber/builds/1/cucumber-html-reports/.cache/web/app/node_modules/eonasdan-bootstrap-datetimepicker/package.json
[CucumberReport] /var/lib/jenkins/jobs/Development/jobs/Cucumber/builds/1/cucumber-html-reports/.cache/web/app/node_modules/error-ex/package.json
[CucumberReport] /var/lib/jenkins/jobs/Development/jobs/Cucumber/builds/1/cucumber-html-reports/.cache/web/app/node_modules/escape-string-regexp/package.json
[CucumberReport] /var/lib/jenkins/jobs/Development/jobs/Cucumber/builds/1/cucumber-html-reports/.cache/web/app/node_modules/extend/.jscs.json
[CucumberReport] /var/lib/jenkins/jobs/Development/jobs/Cucumber/builds/1/cucumber-html-reports/.cache/web/app/node_modules/extend/component.json
[CucumberReport] /var/lib/jenkins/jobs/Development/jobs/Cucumber/builds/1/cucumber-html-reports/.cache/web/app/node_modules/extend/package.json
[CucumberReport] /var/lib/jenkins/jobs/Development/jobs/Cucumber/builds/1/cucumber-html-reports/.cache/web/app/node_modules/extsprintf/package.json
[CucumberReport] /var/lib/jenkins/jobs/Development/jobs/Cucumber/builds/1/cucumber-html-reports/.cache/web/app/node_modules/fast-deep-equal/package.json
[CucumberReport] /var/lib/jenkins/jobs/Development/jobs/Cucumber/builds/1/cucumber-html-reports/.cache/web/app/node_modules/fast-json-stable-stringify/benchmark/test.json
[CucumberReport] /var/lib/jenkins/jobs/Development/jobs/Cucumber/builds/1/cucumber-html-reports/.cache/web/app/node_modules/fast-json-stable-stringify/package.json
[CucumberReport] /var/lib/jenkins/jobs/Development/jobs/Cucumber/builds/1/cucumber-html-reports/.cache/web/app/node_modules/find-up/package.json
[CucumberReport] /var/lib/jenkins/jobs/Development/jobs/Cucumber/builds/1/cucumber-html-reports/.cache/web/app/node_modules/font-awesome-sass/package.json
[CucumberReport] /var/lib/jenkins/jobs/Development/jobs/Cucumber/builds/1/cucumber-html-reports/.cache/web/app/node_modules/font-awesome/package.json
[CucumberReport] /var/lib/jenkins/jobs/Development/jobs/Cucumber/builds/1/cucumber-html-reports/.cache/web/app/node_modules/forever-agent/package.json
[CucumberReport] /var/lib/jenkins/jobs/Development/jobs/Cucumber/builds/1/cucumber-html-reports/.cache/web/app/node_modules/form-data/package.json
[CucumberReport] /var/lib/jenkins/jobs/Development/jobs/Cucumber/builds/1/cucumber-html-reports/.cache/web/app/node_modules/fs.realpath/package.json
[CucumberReport] /var/lib/jenkins/jobs/Development/jobs/Cucumber/builds/1/cucumber-html-reports/.cache/web/app/node_modules/fstream/package.json
[CucumberReport] /var/lib/jenkins/jobs/Development/jobs/Cucumber/builds/1/cucumber-html-reports/.cache/web/app/node_modules/gauge/package.json
[CucumberReport] /var/lib/jenkins/jobs/Development/jobs/Cucumber/builds/1/cucumber-html-reports/.cache/web/app/node_modules/gaze/package.json
[CucumberReport] /var/lib/jenkins/jobs/Development/jobs/Cucumber/builds/1/cucumber-html-reports/.cache/web/app/node_modules/get-caller-file/package.json
[CucumberReport] /var/lib/jenkins/jobs/Development/jobs/Cucumber/builds/1/cucumber-html-reports/.cache/web/app/node_modules/get-stdin/package.json
[CucumberReport] /var/lib/jenkins/jobs/Development/jobs/Cucumber/builds/1/cucumber-html-reports/.cache/web/app/node_modules/getpass/package.json
[CucumberReport] /var/lib/jenkins/jobs/Development/jobs/Cucumber/builds/1/cucumber-html-reports/.cache/web/app/node_modules/glob/package.json
[CucumberReport] /var/lib/jenkins/jobs/Development/jobs/Cucumber/builds/1/cucumber-html-reports/.cache/web/app/node_modules/globule/package.json
[CucumberReport] /var/lib/jenkins/jobs/Development/jobs/Cucumber/builds/1/cucumber-html-reports/.cache/web/app/node_modules/google-code-prettify/bower.json
[CucumberReport] /var/lib/jenkins/jobs/Development/jobs/Cucumber/builds/1/cucumber-html-reports/.cache/web/app/node_modules/google-code-prettify/package.json
[CucumberReport] /var/lib/jenkins/jobs/Development/jobs/Cucumber/builds/1/cucumber-html-reports/.cache/web/app/node_modules/graceful-fs/package.json
[CucumberReport] /var/lib/jenkins/jobs/Development/jobs/Cucumber/builds/1/cucumber-html-reports/.cache/web/app/node_modules/har-schema/lib/afterRequest.json
[CucumberReport] /var/lib/jenkins/jobs/Development/jobs/Cucumber/builds/1/cucumber-html-reports/.cache/web/app/node_modules/har-schema/lib/beforeRequest.json
[CucumberReport] /var/lib/jenkins/jobs/Development/jobs/Cucumber/builds/1/cucumber-html-reports/.cache/web/app/node_modules/har-schema/lib/browser.json
[CucumberReport] /var/lib/jenkins/jobs/Development/jobs/Cucumber/builds/1/cucumber-html-reports/.cache/web/app/node_modules/har-schema/lib/cache.json
[CucumberReport] /var/lib/jenkins/jobs/Development/jobs/Cucumber/builds/1/cucumber-html-reports/.cache/web/app/node_modules/har-schema/lib/content.json
[CucumberReport] /var/lib/jenkins/jobs/Development/jobs/Cucumber/builds/1/cucumber-html-reports/.cache/web/app/node_modules/har-schema/lib/cookie.json
[CucumberReport] /var/lib/jenkins/jobs/Development/jobs/Cucumber/builds/1/cucumber-html-reports/.cache/web/app/node_modules/har-schema/lib/creator.json
[CucumberReport] /var/lib/jenkins/jobs/Development/jobs/Cucumber/builds/1/cucumber-html-reports/.cache/web/app/node_modules/har-schema/lib/entry.json
[CucumberReport] /var/lib/jenkins/jobs/Development/jobs/Cucumber/builds/1/cucumber-html-reports/.cache/web/app/node_modules/har-schema/lib/har.json
[CucumberReport] /var/lib/jenkins/jobs/Development/jobs/Cucumber/builds/1/cucumber-html-reports/.cache/web/app/node_modules/har-schema/lib/header.json
[CucumberReport] /var/lib/jenkins/jobs/Development/jobs/Cucumber/builds/1/cucumber-html-reports/.cache/web/app/node_modules/har-schema/lib/log.json
[CucumberReport] /var/lib/jenkins/jobs/Development/jobs/Cucumber/builds/1/cucumber-html-reports/.cache/web/app/node_modules/har-schema/lib/page.json
[CucumberReport] /var/lib/jenkins/jobs/Development/jobs/Cucumber/builds/1/cucumber-html-reports/.cache/web/app/node_modules/har-schema/lib/pageTimings.json
[CucumberReport] /var/lib/jenkins/jobs/Development/jobs/Cucumber/builds/1/cucumber-html-reports/.cache/web/app/node_modules/har-schema/lib/postData.json
[CucumberReport] /var/lib/jenkins/jobs/Development/jobs/Cucumber/builds/1/cucumber-html-reports/.cache/web/app/node_modules/har-schema/lib/query.json
[CucumberReport] /var/lib/jenkins/jobs/Development/jobs/Cucumber/builds/1/cucumber-html-reports/.cache/web/app/node_modules/har-schema/lib/request.json
[CucumberReport] /var/lib/jenkins/jobs/Development/jobs/Cucumber/builds/1/cucumber-html-reports/.cache/web/app/node_modules/har-schema/lib/response.json
[CucumberReport] /var/lib/jenkins/jobs/Development/jobs/Cucumber/builds/1/cucumber-html-reports/.cache/web/app/node_modules/har-schema/lib/timings.json
[CucumberReport] /var/lib/jenkins/jobs/Development/jobs/Cucumber/builds/1/cucumber-html-reports/.cache/web/app/node_modules/har-schema/package.json
[CucumberReport] /var/lib/jenkins/jobs/Development/jobs/Cucumber/builds/1/cucumber-html-reports/.cache/web/app/node_modules/har-validator/package.json
[CucumberReport] /var/lib/jenkins/jobs/Development/jobs/Cucumber/builds/1/cucumber-html-reports/.cache/web/app/node_modules/has-ansi/package.json
[CucumberReport] /var/lib/jenkins/jobs/Development/jobs/Cucumber/builds/1/cucumber-html-reports/.cache/web/app/node_modules/has-unicode/package.json
[CucumberReport] /var/lib/jenkins/jobs/Development/jobs/Cucumber/builds/1/cucumber-html-reports/.cache/web/app/node_modules/hosted-git-info/package.json
[CucumberReport] /var/lib/jenkins/jobs/Development/jobs/Cucumber/builds/1/cucumber-html-reports/.cache/web/app/node_modules/http-signature/package.json
[CucumberReport] /var/lib/jenkins/jobs/Development/jobs/Cucumber/builds/1/cucumber-html-reports/.cache/web/app/node_modules/in-publish/package.json
[CucumberReport] /var/lib/jenkins/jobs/Development/jobs/Cucumber/builds/1/cucumber-html-reports/.cache/web/app/node_modules/in-publish/test/package.json
[CucumberReport] /var/lib/jenkins/jobs/Development/jobs/Cucumber/builds/1/cucumber-html-reports/.cache/web/app/node_modules/indent-string/package.json
[CucumberReport] /var/lib/jenkins/jobs/Development/jobs/Cucumber/builds/1/cucumber-html-reports/.cache/web/app/node_modules/inflight/package.json
[CucumberReport] /var/lib/jenkins/jobs/Development/jobs/Cucumber/builds/1/cucumber-html-reports/.cache/web/app/node_modules/inherits/package.json
[CucumberReport] /var/lib/jenkins/jobs/Development/jobs/Cucumber/builds/1/cucumber-html-reports/.cache/web/app/node_modules/invert-kv/package.json
[CucumberReport] /var/lib/jenkins/jobs/Development/jobs/Cucumber/builds/1/cucumber-html-reports/.cache/web/app/node_modules/is-arrayish/package.json
[CucumberReport] /var/lib/jenkins/jobs/Development/jobs/Cucumber/builds/1/cucumber-html-reports/.cache/web/app/node_modules/is-finite/package.json
[CucumberReport] /var/lib/jenkins/jobs/Development/jobs/Cucumber/builds/1/cucumber-html-reports/.cache/web/app/node_modules/is-fullwidth-code-point/package.json
[CucumberReport] /var/lib/jenkins/jobs/Development/jobs/Cucumber/builds/1/cucumber-html-reports/.cache/web/app/node_modules/is-typedarray/package.json
[CucumberReport] /var/lib/jenkins/jobs/Development/jobs/Cucumber/builds/1/cucumber-html-reports/.cache/web/app/node_modules/is-utf8/package.json
[CucumberReport] /var/lib/jenkins/jobs/Development/jobs/Cucumber/builds/1/cucumber-html-reports/.cache/web/app/node_modules/isarray/component.json
[CucumberReport] /var/lib/jenkins/jobs/Development/jobs/Cucumber/builds/1/cucumber-html-reports/.cache/web/app/node_modules/isarray/package.json
[CucumberReport] /var/lib/jenkins/jobs/Development/jobs/Cucumber/builds/1/cucumber-html-reports/.cache/web/app/node_modules/isexe/package.json
[CucumberReport] /var/lib/jenkins/jobs/Development/jobs/Cucumber/builds/1/cucumber-html-reports/.cache/web/app/node_modules/isstream/package.json
[CucumberReport] /var/lib/jenkins/jobs/Development/jobs/Cucumber/builds/1/cucumber-html-reports/.cache/web/app/node_modules/jquery-match-height/bower.json
[CucumberReport] /var/lib/jenkins/jobs/Development/jobs/Cucumber/builds/1/cucumber-html-reports/.cache/web/app/node_modules/jquery-match-height/matchHeight.jquery.json
[CucumberReport] /var/lib/jenkins/jobs/Development/jobs/Cucumber/builds/1/cucumber-html-reports/.cache/web/app/node_modules/jquery-match-height/package.json
[CucumberReport] /var/lib/jenkins/jobs/Development/jobs/Cucumber/builds/1/cucumber-html-reports/.cache/web/app/node_modules/jquery-ui-dist/package.json
[CucumberReport] /var/lib/jenkins/jobs/Development/jobs/Cucumber/builds/1/cucumber-html-reports/.cache/web/app/node_modules/jquery/bower.json
[CucumberReport] /var/lib/jenkins/jobs/Development/jobs/Cucumber/builds/1/cucumber-html-reports/.cache/web/app/node_modules/jquery/package.json
[CucumberReport] /var/lib/jenkins/jobs/Development/jobs/Cucumber/builds/1/cucumber-html-reports/.cache/web/app/node_modules/jquery/src/.eslintrc.json
[CucumberReport] /var/lib/jenkins/jobs/Development/jobs/Cucumber/builds/1/cucumber-html-reports/.cache/web/app/node_modules/js-base64/bower.json
[CucumberReport] /var/lib/jenkins/jobs/Development/jobs/Cucumber/builds/1/cucumber-html-reports/.cache/web/app/node_modules/js-base64/package.json
[CucumberReport] /var/lib/jenkins/jobs/Development/jobs/Cucumber/builds/1/cucumber-html-reports/.cache/web/app/node_modules/jsbn/package.json
[CucumberReport] /var/lib/jenkins/jobs/Development/jobs/Cucumber/builds/1/cucumber-html-reports/.cache/web/app/node_modules/json-schema-traverse/package.json
[CucumberReport] /var/lib/jenkins/jobs/Development/jobs/Cucumber/builds/1/cucumber-html-reports/.cache/web/app/node_modules/json-schema/package.json
[CucumberReport] /var/lib/jenkins/jobs/Development/jobs/Cucumber/builds/1/cucumber-html-reports/.cache/web/app/node_modules/json-stringify-safe/package.json
[CucumberReport] /var/lib/jenkins/jobs/Development/jobs/Cucumber/builds/1/cucumber-html-reports/.cache/web/app/node_modules/jsprim/package.json
[CucumberReport] /var/lib/jenkins/jobs/Development/jobs/Cucumber/builds/1/cucumber-html-reports/.cache/web/app/node_modules/lcid/lcid.json
[CucumberReport] /var/lib/jenkins/jobs/Development/jobs/Cucumber/builds/1/cucumber-html-reports/.cache/web/app/node_modules/lcid/package.json
[CucumberReport] /var/lib/jenkins/jobs/Development/jobs/Cucumber/builds/1/cucumber-html-reports/.cache/web/app/node_modules/load-json-file/package.json
[CucumberReport] /var/lib/jenkins/jobs/Development/jobs/Cucumber/builds/1/cucumber-html-reports/.cache/web/app/node_modules/lodash.assign/package.json
[CucumberReport] /var/lib/jenkins/jobs/Development/jobs/Cucumber/builds/1/cucumber-html-reports/.cache/web/app/node_modules/lodash.clonedeep/package.json
[CucumberReport] /var/lib/jenkins/jobs/Development/jobs/Cucumber/builds/1/cucumber-html-reports/.cache/web/app/node_modules/lodash.mergewith/package.json
[CucumberReport] /var/lib/jenkins/jobs/Development/jobs/Cucumber/builds/1/cucumber-html-reports/.cache/web/app/node_modules/lodash/package.json
[CucumberReport] /var/lib/jenkins/jobs/Development/jobs/Cucumber/builds/1/cucumber-html-reports/.cache/web/app/node_modules/loud-rejection/package.json
[CucumberReport] /var/lib/jenkins/jobs/Development/jobs/Cucumber/builds/1/cucumber-html-reports/.cache/web/app/node_modules/lru-cache/package.json
[CucumberReport] /var/lib/jenkins/jobs/Development/jobs/Cucumber/builds/1/cucumber-html-reports/.cache/web/app/node_modules/map-obj/package.json
[CucumberReport] /var/lib/jenkins/jobs/Development/jobs/Cucumber/builds/1/cucumber-html-reports/.cache/web/app/node_modules/meow/package.json
[CucumberReport] /var/lib/jenkins/jobs/Development/jobs/Cucumber/builds/1/cucumber-html-reports/.cache/web/app/node_modules/mime-db/db.json
[CucumberReport] /var/lib/jenkins/jobs/Development/jobs/Cucumber/builds/1/cucumber-html-reports/.cache/web/app/node_modules/mime-db/package.json
[CucumberReport] /var/lib/jenkins/jobs/Development/jobs/Cucumber/builds/1/cucumber-html-reports/.cache/web/app/node_modules/mime-types/package.json
[CucumberReport] /var/lib/jenkins/jobs/Development/jobs/Cucumber/builds/1/cucumber-html-reports/.cache/web/app/node_modules/minimatch/package.json
[CucumberReport] /var/lib/jenkins/jobs/Development/jobs/Cucumber/builds/1/cucumber-html-reports/.cache/web/app/node_modules/minimist/package.json
[CucumberReport] /var/lib/jenkins/jobs/Development/jobs/Cucumber/builds/1/cucumber-html-reports/.cache/web/app/node_modules/mkdirp/node_modules/minimist/package.json
[CucumberReport] /var/lib/jenkins/jobs/Development/jobs/Cucumber/builds/1/cucumber-html-reports/.cache/web/app/node_modules/mkdirp/package.json
[CucumberReport] /var/lib/jenkins/jobs/Development/jobs/Cucumber/builds/1/cucumber-html-reports/.cache/web/app/node_modules/moment-timezone/composer.json
[CucumberReport] /var/lib/jenkins/jobs/Development/jobs/Cucumber/builds/1/cucumber-html-reports/.cache/web/app/node_modules/moment-timezone/data/meta/latest.json
[CucumberReport] /var/lib/jenkins/jobs/Development/jobs/Cucumber/builds/1/cucumber-html-reports/.cache/web/app/node_modules/moment-timezone/data/packed/latest.json
[CucumberReport] /var/lib/jenkins/jobs/Development/jobs/Cucumber/builds/1/cucumber-html-reports/.cache/web/app/node_modules/moment-timezone/data/unpacked/latest.json
[CucumberReport] /var/lib/jenkins/jobs/Development/jobs/Cucumber/builds/1/cucumber-html-reports/.cache/web/app/node_modules/moment-timezone/package.json
[CucumberReport] /var/lib/jenkins/jobs/Development/jobs/Cucumber/builds/1/cucumber-html-reports/.cache/web/app/node_modules/moment/package.json
[CucumberReport] /var/lib/jenkins/jobs/Development/jobs/Cucumber/builds/1/cucumber-html-reports/.cache/web/app/node_modules/nan/package.json
[CucumberReport] /var/lib/jenkins/jobs/Development/jobs/Cucumber/builds/1/cucumber-html-reports/.cache/web/app/node_modules/nan/tools/package.json
[CucumberReport] /var/lib/jenkins/jobs/Development/jobs/Cucumber/builds/1/cucumber-html-reports/.cache/web/app/node_modules/node-gyp/node_modules/semver/package.json
[CucumberReport] /var/lib/jenkins/jobs/Development/jobs/Cucumber/builds/1/cucumber-html-reports/.cache/web/app/node_modules/node-gyp/package.json
[CucumberReport] /var/lib/jenkins/jobs/Development/jobs/Cucumber/builds/1/cucumber-html-reports/.cache/web/app/node_modules/node-sass/package.json
[CucumberReport] /var/lib/jenkins/jobs/Development/jobs/Cucumber/builds/1/cucumber-html-reports/.cache/web/app/node_modules/nopt/package.json
[CucumberReport] /var/lib/jenkins/jobs/Development/jobs/Cucumber/builds/1/cucumber-html-reports/.cache/web/app/node_modules/normalize-package-data/lib/typos.json
[CucumberReport] /var/lib/jenkins/jobs/Development/jobs/Cucumber/builds/1/cucumber-html-reports/.cache/web/app/node_modules/normalize-package-data/lib/warning_messages.json
[CucumberReport] /var/lib/jenkins/jobs/Development/jobs/Cucumber/builds/1/cucumber-html-reports/.cache/web/app/node_modules/normalize-package-data/package.json
[CucumberReport] /var/lib/jenkins/jobs/Development/jobs/Cucumber/builds/1/cucumber-html-reports/.cache/web/app/node_modules/npmlog/package.json
[CucumberReport] /var/lib/jenkins/jobs/Development/jobs/Cucumber/builds/1/cucumber-html-reports/.cache/web/app/node_modules/number-is-nan/package.json
[CucumberReport] /var/lib/jenkins/jobs/Development/jobs/Cucumber/builds/1/cucumber-html-reports/.cache/web/app/node_modules/oauth-sign/package.json
[CucumberReport] /var/lib/jenkins/jobs/Development/jobs/Cucumber/builds/1/cucumber-html-reports/.cache/web/app/node_modules/object-assign/package.json
[CucumberReport] /var/lib/jenkins/jobs/Development/jobs/Cucumber/builds/1/cucumber-html-reports/.cache/web/app/node_modules/once/package.json
[CucumberReport] /var/lib/jenkins/jobs/Development/jobs/Cucumber/builds/1/cucumber-html-reports/.cache/web/app/node_modules/options/package.json
[CucumberReport] /var/lib/jenkins/jobs/Development/jobs/Cucumber/builds/1/cucumber-html-reports/.cache/web/app/node_modules/os-homedir/package.json
[CucumberReport] /var/lib/jenkins/jobs/Development/jobs/Cucumber/builds/1/cucumber-html-reports/.cache/web/app/node_modules/os-locale/package.json
[CucumberReport] /var/lib/jenkins/jobs/Development/jobs/Cucumber/builds/1/cucumber-html-reports/.cache/web/app/node_modules/os-tmpdir/package.json
[CucumberReport] /var/lib/jenkins/jobs/Development/jobs/Cucumber/builds/1/cucumber-html-reports/.cache/web/app/node_modules/osenv/package.json
[CucumberReport] /var/lib/jenkins/jobs/Development/jobs/Cucumber/builds/1/cucumber-html-reports/.cache/web/app/node_modules/parse-json/package.json
[CucumberReport] /var/lib/jenkins/jobs/Development/jobs/Cucumber/builds/1/cucumber-html-reports/.cache/web/app/node_modules/path-exists/package.json
[CucumberReport] /var/lib/jenkins/jobs/Development/jobs/Cucumber/builds/1/cucumber-html-reports/.cache/web/app/node_modules/path-is-absolute/package.json
[CucumberReport] /var/lib/jenkins/jobs/Development/jobs/Cucumber/builds/1/cucumber-html-reports/.cache/web/app/node_modules/path-parse/package.json
[CucumberReport] /var/lib/jenkins/jobs/Development/jobs/Cucumber/builds/1/cucumber-html-reports/.cache/web/app/node_modules/path-type/package.json
[CucumberReport] /var/lib/jenkins/jobs/Development/jobs/Cucumber/builds/1/cucumber-html-reports/.cache/web/app/node_modules/patternfly-bootstrap-combobox/bower.json
[CucumberReport] /var/lib/jenkins/jobs/Development/jobs/Cucumber/builds/1/cucumber-html-reports/.cache/web/app/node_modules/patternfly-bootstrap-combobox/package.json
[CucumberReport] /var/lib/jenkins/jobs/Development/jobs/Cucumber/builds/1/cucumber-html-reports/.cache/web/app/node_modules/patternfly-bootstrap-treeview/bower.json
[CucumberReport] /var/lib/jenkins/jobs/Development/jobs/Cucumber/builds/1/cucumber-html-reports/.cache/web/app/node_modules/patternfly-bootstrap-treeview/node_modules/bootstrap/grunt/configBridge.json
[CucumberReport] /var/lib/jenkins/jobs/Development/jobs/Cucumber/builds/1/cucumber-html-reports/.cache/web/app/node_modules/patternfly-bootstrap-treeview/node_modules/bootstrap/package.json
[CucumberReport] /var/lib/jenkins/jobs/Development/jobs/Cucumber/builds/1/cucumber-html-reports/.cache/web/app/node_modules/patternfly-bootstrap-treeview/package.json
[CucumberReport] /var/lib/jenkins/jobs/Development/jobs/Cucumber/builds/1/cucumber-html-reports/.cache/web/app/node_modules/patternfly-bootstrap-treeview/public/data.json
[CucumberReport] /var/lib/jenkins/jobs/Development/jobs/Cucumber/builds/1/cucumber-html-reports/.cache/web/app/node_modules/patternfly-bootstrap-treeview/tests/data.json
[CucumberReport] /var/lib/jenkins/jobs/Development/jobs/Cucumber/builds/1/cucumber-html-reports/.cache/web/app/node_modules/patternfly/node_modules/bootstrap-select/bower.json
[CucumberReport] /var/lib/jenkins/jobs/Development/jobs/Cucumber/builds/1/cucumber-html-reports/.cache/web/app/node_modules/patternfly/node_modules/bootstrap-select/composer.json
[CucumberReport] /var/lib/jenkins/jobs/Development/jobs/Cucumber/builds/1/cucumber-html-reports/.cache/web/app/node_modules/patternfly/node_modules/bootstrap-select/package.json
[CucumberReport] /var/lib/jenkins/jobs/Development/jobs/Cucumber/builds/1/cucumber-html-reports/.cache/web/app/node_modules/patternfly/node_modules/bootstrap/grunt/configBridge.json
[CucumberReport] /var/lib/jenkins/jobs/Development/jobs/Cucumber/builds/1/cucumber-html-reports/.cache/web/app/node_modules/patternfly/node_modules/bootstrap/package.json
[CucumberReport] /var/lib/jenkins/jobs/Development/jobs/Cucumber/builds/1/cucumber-html-reports/.cache/web/app/node_modules/patternfly/package.json
[CucumberReport] /var/lib/jenkins/jobs/Development/jobs/Cucumber/builds/1/cucumber-html-reports/.cache/web/app/node_modules/performance-now/package.json
[CucumberReport] /var/lib/jenkins/jobs/Development/jobs/Cucumber/builds/1/cucumber-html-reports/.cache/web/app/node_modules/pify/package.json
[CucumberReport] /var/lib/jenkins/jobs/Development/jobs/Cucumber/builds/1/cucumber-html-reports/.cache/web/app/node_modules/pinkie-promise/package.json
[CucumberReport] /var/lib/jenkins/jobs/Development/jobs/Cucumber/builds/1/cucumber-html-reports/.cache/web/app/node_modules/pinkie/package.json
[CucumberReport] /var/lib/jenkins/jobs/Development/jobs/Cucumber/builds/1/cucumber-html-reports/.cache/web/app/node_modules/process-nextick-args/package.json
[CucumberReport] /var/lib/jenkins/jobs/Development/jobs/Cucumber/builds/1/cucumber-html-reports/.cache/web/app/node_modules/pseudomap/package.json
[CucumberReport] /var/lib/jenkins/jobs/Development/jobs/Cucumber/builds/1/cucumber-html-reports/.cache/web/app/node_modules/psl/data/rules.json
[CucumberReport] /var/lib/jenkins/jobs/Development/jobs/Cucumber/builds/1/cucumber-html-reports/.cache/web/app/node_modules/psl/package.json
[CucumberReport] /var/lib/jenkins/jobs/Development/jobs/Cucumber/builds/1/cucumber-html-reports/.cache/web/app/node_modules/punycode/package.json
[CucumberReport] /var/lib/jenkins/jobs/Development/jobs/Cucumber/builds/1/cucumber-html-reports/.cache/web/app/node_modules/qs/package.json
[CucumberReport] /var/lib/jenkins/jobs/Development/jobs/Cucumber/builds/1/cucumber-html-reports/.cache/web/app/node_modules/read-pkg-up/package.json
[CucumberReport] /var/lib/jenkins/jobs/Development/jobs/Cucumber/builds/1/cucumber-html-reports/.cache/web/app/node_modules/read-pkg/package.json
[CucumberReport] /var/lib/jenkins/jobs/Development/jobs/Cucumber/builds/1/cucumber-html-reports/.cache/web/app/node_modules/readable-stream/package.json
[CucumberReport] /var/lib/jenkins/jobs/Development/jobs/Cucumber/builds/1/cucumber-html-reports/.cache/web/app/node_modules/redent/package.json
[CucumberReport] /var/lib/jenkins/jobs/Development/jobs/Cucumber/builds/1/cucumber-html-reports/.cache/web/app/node_modules/repeating/package.json
[CucumberReport] /var/lib/jenkins/jobs/Development/jobs/Cucumber/builds/1/cucumber-html-reports/.cache/web/app/node_modules/request/package.json
[CucumberReport] /var/lib/jenkins/jobs/Development/jobs/Cucumber/builds/1/cucumber-html-reports/.cache/web/app/node_modules/require-directory/package.json
[CucumberReport] /var/lib/jenkins/jobs/Development/jobs/Cucumber/builds/1/cucumber-html-reports/.cache/web/app/node_modules/require-main-filename/package.json
[CucumberReport] /var/lib/jenkins/jobs/Development/jobs/Cucumber/builds/1/cucumber-html-reports/.cache/web/app/node_modules/resolve/lib/core.json
[CucumberReport] /var/lib/jenkins/jobs/Development/jobs/Cucumber/builds/1/cucumber-html-reports/.cache/web/app/node_modules/resolve/package.json
[CucumberReport] /var/lib/jenkins/jobs/Development/jobs/Cucumber/builds/1/cucumber-html-reports/.cache/web/app/node_modules/resolve/test/module_dir/zmodules/bbb/package.json
[CucumberReport] /var/lib/jenkins/jobs/Development/jobs/Cucumber/builds/1/cucumber-html-reports/.cache/web/app/node_modules/resolve/test/resolver/baz/package.json
[CucumberReport] /var/lib/jenkins/jobs/Development/jobs/Cucumber/builds/1/cucumber-html-reports/.cache/web/app/node_modules/resolve/test/resolver/browser_field/package.json
[CucumberReport] /var/lib/jenkins/jobs/Development/jobs/Cucumber/builds/1/cucumber-html-reports/.cache/web/app/node_modules/resolve/test/resolver/dot_main/package.json
[CucumberReport] /var/lib/jenkins/jobs/Development/jobs/Cucumber/builds/1/cucumber-html-reports/.cache/web/app/node_modules/resolve/test/resolver/dot_slash_main/package.json
[CucumberReport] /var/lib/jenkins/jobs/Development/jobs/Cucumber/builds/1/cucumber-html-reports/.cache/web/app/node_modules/resolve/test/resolver/incorrect_main/package.json
[CucumberReport] /var/lib/jenkins/jobs/Development/jobs/Cucumber/builds/1/cucumber-html-reports/.cache/web/app/node_modules/resolve/test/resolver/invalid_main/package.json
[CucumberReport] /var/lib/jenkins/jobs/Development/jobs/Cucumber/builds/1/cucumber-html-reports/.cache/web/app/node_modules/resolve/test/resolver/multirepo/lerna.json
[CucumberReport] /var/lib/jenkins/jobs/Development/jobs/Cucumber/builds/1/cucumber-html-reports/.cache/web/app/node_modules/resolve/test/resolver/multirepo/package.json
[CucumberReport] /var/lib/jenkins/jobs/Development/jobs/Cucumber/builds/1/cucumber-html-reports/.cache/web/app/node_modules/resolve/test/resolver/multirepo/packages/package-a/package.json
[CucumberReport] /var/lib/jenkins/jobs/Development/jobs/Cucumber/builds/1/cucumber-html-reports/.cache/web/app/node_modules/resolve/test/resolver/multirepo/packages/package-b/package.json
[CucumberReport] /var/lib/jenkins/jobs/Development/jobs/Cucumber/builds/1/cucumber-html-reports/.cache/web/app/node_modules/rimraf/package.json
[CucumberReport] /var/lib/jenkins/jobs/Development/jobs/Cucumber/builds/1/cucumber-html-reports/.cache/web/app/node_modules/safe-buffer/package.json
[CucumberReport] /var/lib/jenkins/jobs/Development/jobs/Cucumber/builds/1/cucumber-html-reports/.cache/web/app/node_modules/safer-buffer/package.json
[CucumberReport] /var/lib/jenkins/jobs/Development/jobs/Cucumber/builds/1/cucumber-html-reports/.cache/web/app/node_modules/sass-graph/package.json
[CucumberReport] /var/lib/jenkins/jobs/Development/jobs/Cucumber/builds/1/cucumber-html-reports/.cache/web/app/node_modules/scss-tokenizer/package.json
[CucumberReport] /var/lib/jenkins/jobs/Development/jobs/Cucumber/builds/1/cucumber-html-reports/.cache/web/app/node_modules/semver/package.json
[CucumberReport] /var/lib/jenkins/jobs/Development/jobs/Cucumber/builds/1/cucumber-html-reports/.cache/web/app/node_modules/set-blocking/package.json
[CucumberReport] /var/lib/jenkins/jobs/Development/jobs/Cucumber/builds/1/cucumber-html-reports/.cache/web/app/node_modules/signal-exit/package.json
[CucumberReport] /var/lib/jenkins/jobs/Development/jobs/Cucumber/builds/1/cucumber-html-reports/.cache/web/app/node_modules/source-map/package.json
[CucumberReport] /var/lib/jenkins/jobs/Development/jobs/Cucumber/builds/1/cucumber-html-reports/.cache/web/app/node_modules/spdx-correct/package.json
[CucumberReport] /var/lib/jenkins/jobs/Development/jobs/Cucumber/builds/1/cucumber-html-reports/.cache/web/app/node_modules/spdx-exceptions/index.json
[CucumberReport] /var/lib/jenkins/jobs/Development/jobs/Cucumber/builds/1/cucumber-html-reports/.cache/web/app/node_modules/spdx-exceptions/package.json
[CucumberReport] /var/lib/jenkins/jobs/Development/jobs/Cucumber/builds/1/cucumber-html-reports/.cache/web/app/node_modules/spdx-expression-parse/package.json
[CucumberReport] /var/lib/jenkins/jobs/Development/jobs/Cucumber/builds/1/cucumber-html-reports/.cache/web/app/node_modules/spdx-license-ids/deprecated.json
[CucumberReport] /var/lib/jenkins/jobs/Development/jobs/Cucumber/builds/1/cucumber-html-reports/.cache/web/app/node_modules/spdx-license-ids/index.json
[CucumberReport] /var/lib/jenkins/jobs/Development/jobs/Cucumber/builds/1/cucumber-html-reports/.cache/web/app/node_modules/spdx-license-ids/package.json
[CucumberReport] /var/lib/jenkins/jobs/Development/jobs/Cucumber/builds/1/cucumber-html-reports/.cache/web/app/node_modules/sshpk/package.json
[CucumberReport] /var/lib/jenkins/jobs/Development/jobs/Cucumber/builds/1/cucumber-html-reports/.cache/web/app/node_modules/stdout-stream/package.json
[CucumberReport] /var/lib/jenkins/jobs/Development/jobs/Cucumber/builds/1/cucumber-html-reports/.cache/web/app/node_modules/string-width/package.json
[CucumberReport] /var/lib/jenkins/jobs/Development/jobs/Cucumber/builds/1/cucumber-html-reports/.cache/web/app/node_modules/string_decoder/package.json
[CucumberReport] /var/lib/jenkins/jobs/Development/jobs/Cucumber/builds/1/cucumber-html-reports/.cache/web/app/node_modules/strip-ansi/package.json
[CucumberReport] /var/lib/jenkins/jobs/Development/jobs/Cucumber/builds/1/cucumber-html-reports/.cache/web/app/node_modules/strip-bom/package.json
[CucumberReport] /var/lib/jenkins/jobs/Development/jobs/Cucumber/builds/1/cucumber-html-reports/.cache/web/app/node_modules/strip-indent/package.json
[CucumberReport] /var/lib/jenkins/jobs/Development/jobs/Cucumber/builds/1/cucumber-html-reports/.cache/web/app/node_modules/supports-color/package.json
[CucumberReport] /var/lib/jenkins/jobs/Development/jobs/Cucumber/builds/1/cucumber-html-reports/.cache/web/app/node_modules/tar/package.json
[CucumberReport] /var/lib/jenkins/jobs/Development/jobs/Cucumber/builds/1/cucumber-html-reports/.cache/web/app/node_modules/tough-cookie/node_modules/punycode/package.json
[CucumberReport] /var/lib/jenkins/jobs/Development/jobs/Cucumber/builds/1/cucumber-html-reports/.cache/web/app/node_modules/tough-cookie/package.json
[CucumberReport] /var/lib/jenkins/jobs/Development/jobs/Cucumber/builds/1/cucumber-html-reports/.cache/web/app/node_modules/trim-newlines/package.json
[CucumberReport] /var/lib/jenkins/jobs/Development/jobs/Cucumber/builds/1/cucumber-html-reports/.cache/web/app/node_modules/true-case-path/package.json
[CucumberReport] /var/lib/jenkins/jobs/Development/jobs/Cucumber/builds/1/cucumber-html-reports/.cache/web/app/node_modules/tunnel-agent/package.json
[CucumberReport] /var/lib/jenkins/jobs/Development/jobs/Cucumber/builds/1/cucumber-html-reports/.cache/web/app/node_modules/tweetnacl/package.json
[CucumberReport] /var/lib/jenkins/jobs/Development/jobs/Cucumber/builds/1/cucumber-html-reports/.cache/web/app/node_modules/ultron/package.json
[CucumberReport] /var/lib/jenkins/jobs/Development/jobs/Cucumber/builds/1/cucumber-html-reports/.cache/web/app/node_modules/uri-js/bower.json
[CucumberReport] /var/lib/jenkins/jobs/Development/jobs/Cucumber/builds/1/cucumber-html-reports/.cache/web/app/node_modules/uri-js/package.json
[CucumberReport] /var/lib/jenkins/jobs/Development/jobs/Cucumber/builds/1/cucumber-html-reports/.cache/web/app/node_modules/uri-js/tsconfig.json
[CucumberReport] /var/lib/jenkins/jobs/Development/jobs/Cucumber/builds/1/cucumber-html-reports/.cache/web/app/node_modules/util-deprecate/package.json
[CucumberReport] /var/lib/jenkins/jobs/Development/jobs/Cucumber/builds/1/cucumber-html-reports/.cache/web/app/node_modules/uuid/.eslintrc.json
[CucumberReport] /var/lib/jenkins/jobs/Development/jobs/Cucumber/builds/1/cucumber-html-reports/.cache/web/app/node_modules/uuid/package.json
[CucumberReport] /var/lib/jenkins/jobs/Development/jobs/Cucumber/builds/1/cucumber-html-reports/.cache/web/app/node_modules/validate-npm-package-license/package.json
[CucumberReport] /var/lib/jenkins/jobs/Development/jobs/Cucumber/builds/1/cucumber-html-reports/.cache/web/app/node_modules/verror/package.json
[CucumberReport] /var/lib/jenkins/jobs/Development/jobs/Cucumber/builds/1/cucumber-html-reports/.cache/web/app/node_modules/which-module/package.json
[CucumberReport] /var/lib/jenkins/jobs/Development/jobs/Cucumber/builds/1/cucumber-html-reports/.cache/web/app/node_modules/which/package.json
[CucumberReport] /var/lib/jenkins/jobs/Development/jobs/Cucumber/builds/1/cucumber-html-reports/.cache/web/app/node_modules/wide-align/package.json
[CucumberReport] /var/lib/jenkins/jobs/Development/jobs/Cucumber/builds/1/cucumber-html-reports/.cache/web/app/node_modules/wrap-ansi/package.json
[CucumberReport] /var/lib/jenkins/jobs/Development/jobs/Cucumber/builds/1/cucumber-html-reports/.cache/web/app/node_modules/wrappy/package.json
[CucumberReport] /var/lib/jenkins/jobs/Development/jobs/Cucumber/builds/1/cucumber-html-reports/.cache/web/app/node_modules/ws/package.json
[CucumberReport] /var/lib/jenkins/jobs/Development/jobs/Cucumber/builds/1/cucumber-html-reports/.cache/web/app/node_modules/y18n/package.json
[CucumberReport] /var/lib/jenkins/jobs/Development/jobs/Cucumber/builds/1/cucumber-html-reports/.cache/web/app/node_modules/yallist/package.json
[CucumberReport] /var/lib/jenkins/jobs/Development/jobs/Cucumber/builds/1/cucumber-html-reports/.cache/web/app/node_modules/yargs-parser/node_modules/camelcase/package.json
[CucumberReport] /var/lib/jenkins/jobs/Development/jobs/Cucumber/builds/1/cucumber-html-reports/.cache/web/app/node_modules/yargs-parser/package.json
[CucumberReport] /var/lib/jenkins/jobs/Development/jobs/Cucumber/builds/1/cucumber-html-reports/.cache/web/app/node_modules/yargs/locales/be.json
[CucumberReport] /var/lib/jenkins/jobs/Development/jobs/Cucumber/builds/1/cucumber-html-reports/.cache/web/app/node_modules/yargs/locales/de.json
[CucumberReport] /var/lib/jenkins/jobs/Development/jobs/Cucumber/builds/1/cucumber-html-reports/.cache/web/app/node_modules/yargs/locales/en.json
[CucumberReport] /var/lib/jenkins/jobs/Development/jobs/Cucumber/builds/1/cucumber-html-reports/.cache/web/app/node_modules/yargs/locales/es.json
[CucumberReport] /var/lib/jenkins/jobs/Development/jobs/Cucumber/builds/1/cucumber-html-reports/.cache/web/app/node_modules/yargs/locales/fr.json
[CucumberReport] /var/lib/jenkins/jobs/Development/jobs/Cucumber/builds/1/cucumber-html-reports/.cache/web/app/node_modules/yargs/locales/hi.json
[CucumberReport] /var/lib/jenkins/jobs/Development/jobs/Cucumber/builds/1/cucumber-html-reports/.cache/web/app/node_modules/yargs/locales/hu.json
[CucumberReport] /var/lib/jenkins/jobs/Development/jobs/Cucumber/builds/1/cucumber-html-reports/.cache/web/app/node_modules/yargs/locales/id.json
[CucumberReport] /var/lib/jenkins/jobs/Development/jobs/Cucumber/builds/1/cucumber-html-reports/.cache/web/app/node_modules/yargs/locales/it.json
[CucumberReport] /var/lib/jenkins/jobs/Development/jobs/Cucumber/builds/1/cucumber-html-reports/.cache/web/app/node_modules/yargs/locales/ja.json
[CucumberReport] /var/lib/jenkins/jobs/Development/jobs/Cucumber/builds/1/cucumber-html-reports/.cache/web/app/node_modules/yargs/locales/ko.json
[CucumberReport] /var/lib/jenkins/jobs/Development/jobs/Cucumber/builds/1/cucumber-html-reports/.cache/web/app/node_modules/yargs/locales/nb.json
[CucumberReport] /var/lib/jenkins/jobs/Development/jobs/Cucumber/builds/1/cucumber-html-reports/.cache/web/app/node_modules/yargs/locales/nl.json
[CucumberReport] /var/lib/jenkins/jobs/Development/jobs/Cucumber/builds/1/cucumber-html-reports/.cache/web/app/node_modules/yargs/locales/pirate.json
[CucumberReport] /var/lib/jenkins/jobs/Development/jobs/Cucumber/builds/1/cucumber-html-reports/.cache/web/app/node_modules/yargs/locales/pl.json
[CucumberReport] /var/lib/jenkins/jobs/Development/jobs/Cucumber/builds/1/cucumber-html-reports/.cache/web/app/node_modules/yargs/locales/pt.json
[CucumberReport] /var/lib/jenkins/jobs/Development/jobs/Cucumber/builds/1/cucumber-html-reports/.cache/web/app/node_modules/yargs/locales/pt_BR.json
[CucumberReport] /var/lib/jenkins/jobs/Development/jobs/Cucumber/builds/1/cucumber-html-reports/.cache/web/app/node_modules/yargs/locales/ru.json
[CucumberReport] /var/lib/jenkins/jobs/Development/jobs/Cucumber/builds/1/cucumber-html-reports/.cache/web/app/node_modules/yargs/locales/th.json
[CucumberReport] /var/lib/jenkins/jobs/Development/jobs/Cucumber/builds/1/cucumber-html-reports/.cache/web/app/node_modules/yargs/locales/tr.json
[CucumberReport] /var/lib/jenkins/jobs/Development/jobs/Cucumber/builds/1/cucumber-html-reports/.cache/web/app/node_modules/yargs/locales/zh_CN.json
[CucumberReport] /var/lib/jenkins/jobs/Development/jobs/Cucumber/builds/1/cucumber-html-reports/.cache/web/app/node_modules/yargs/locales/zh_TW.json
[CucumberReport] /var/lib/jenkins/jobs/Development/jobs/Cucumber/builds/1/cucumber-html-reports/.cache/web/app/node_modules/yargs/node_modules/camelcase/package.json
[CucumberReport] /var/lib/jenkins/jobs/Development/jobs/Cucumber/builds/1/cucumber-html-reports/.cache/web/app/node_modules/yargs/package.json
[CucumberReport] /var/lib/jenkins/jobs/Development/jobs/Cucumber/builds/1/cucumber-html-reports/.cache/web/app/package-lock.json
[CucumberReport] /var/lib/jenkins/jobs/Development/jobs/Cucumber/builds/1/cucumber-html-reports/.cache/web/app/package.json
[CucumberReport] /var/lib/jenkins/jobs/Development/jobs/Cucumber/builds/1/cucumber-html-reports/.cache/web/app/short-detector/locale-en.json
[CucumberReport] /var/lib/jenkins/jobs/Development/jobs/Cucumber/builds/1/cucumber-html-reports/.cache/web/app/short-detector/manifest.json
[CucumberReport] /var/lib/jenkins/jobs/Development/jobs/Cucumber/builds/1/cucumber-html-reports/.cache/web/roster/locale-en.json
[CucumberReport] /var/lib/jenkins/jobs/Development/jobs/Cucumber/builds/1/cucumber-html-reports/.cache/web/roster/manifest.json
[CucumberReport] Missing report result - report was not successfully completed
[CucumberReport] Build status is left unchanged
[BFA] Scanning build for known causes...
[BFA] No failure causes found
[BFA] Done. 0s
Finished: FAILURE