FailedConsole Output

Skipping 703 KB.. Full Log
onitor.MarklinMonTest
[INFO] Running jmri.jmrix.marklin.swing.monitor.MarklinMonPaneTest
[INFO] Tests run: 13, Failures: 0, Errors: 0, Skipped: 0, Time elapsed: 2.994 s - in jmri.jmrix.marklin.swing.monitor.MarklinMonPaneTest
[INFO] Running jmri.jmrix.marklin.MarklinSensorTest
[INFO] Tests run: 14, Failures: 0, Errors: 0, Skipped: 0, Time elapsed: 0.126 s - in jmri.jmrix.marklin.MarklinSensorTest
[INFO] Running jmri.jmrix.marklin.BundleTest
[INFO] Tests run: 2, Failures: 0, Errors: 0, Skipped: 0, Time elapsed: 0 s - in jmri.jmrix.marklin.BundleTest
[INFO] Running jmri.jmrix.marklin.MarklinPowerManagerTest
[INFO] Tests run: 1, Failures: 0, Errors: 0, Skipped: 0, Time elapsed: 0.001 s - in jmri.jmrix.marklin.MarklinPowerManagerTest
[INFO] Running jmri.jmrix.marklin.MarklinTrafficControllerTest
[INFO] Tests run: 6, Failures: 0, Errors: 0, Skipped: 0, Time elapsed: 0.002 s - in jmri.jmrix.marklin.MarklinTrafficControllerTest
[INFO] Running jmri.jmrix.marklin.MarklinMessageTest
[INFO] Tests run: 3, Failures: 0, Errors: 0, Skipped: 0, Time elapsed: 0 s - in jmri.jmrix.marklin.MarklinMessageTest
[INFO] Running jmri.jmrix.marklin.MarklinTurnoutManagerTest
[INFO] Tests run: 1, Failures: 0, Errors: 0, Skipped: 0, Time elapsed: 0.002 s - in jmri.jmrix.marklin.MarklinTurnoutManagerTest
[INFO] Running jmri.jmrix.marklin.MarklinConnectionTypeListTest
[INFO] Tests run: 1, Failures: 0, Errors: 0, Skipped: 0, Time elapsed: 0 s - in jmri.jmrix.marklin.MarklinConnectionTypeListTest
[INFO] Running jmri.jmrix.marklin.MarklinTurnoutTest
[INFO] Tests run: 1, Failures: 0, Errors: 0, Skipped: 0, Time elapsed: 0.003 s - in jmri.jmrix.marklin.MarklinTurnoutTest
[INFO] Running jmri.jmrix.marklin.MarklinThrottleManagerTest
[WARNING] Tests run: 16, Failures: 0, Errors: 0, Skipped: 1, Time elapsed: 0.022 s - in jmri.jmrix.marklin.MarklinThrottleManagerTest
[INFO] Running jmri.jmrix.marklin.MarklinPortControllerTest
[INFO] Tests run: 1, Failures: 0, Errors: 0, Skipped: 0, Time elapsed: 0.001 s - in jmri.jmrix.marklin.MarklinPortControllerTest
[INFO] Running jmri.jmrix.marklin.MarklinThrottleTest
[INFO] Tests run: 151, Failures: 0, Errors: 0, Skipped: 0, Time elapsed: 0.205 s - in jmri.jmrix.marklin.MarklinThrottleTest
[INFO] Running jmri.jmrix.marklin.MarklinSystemConnectionMemoTest
[INFO] Tests run: 11, Failures: 0, Errors: 0, Skipped: 0, Time elapsed: 0.017 s - in jmri.jmrix.marklin.MarklinSystemConnectionMemoTest
[INFO] Running jmri.jmrix.marklin.MarklinSensorManagerTest
[INFO] Tests run: 1, Failures: 0, Errors: 0, Skipped: 0, Time elapsed: 0 s - in jmri.jmrix.marklin.MarklinSensorManagerTest
[INFO] Running jmri.jmrix.marklin.MarklinConstantsTest
[INFO] Tests run: 1, Failures: 0, Errors: 0, Skipped: 0, Time elapsed: 0 s - in jmri.jmrix.marklin.MarklinConstantsTest
[INFO] Running jmri.jmrix.marklin.networkdriver.ConnectionConfigTest
[WARNING] Tests run: 8, Failures: 0, Errors: 0, Skipped: 5, Time elapsed: 0.01 s - in jmri.jmrix.marklin.networkdriver.ConnectionConfigTest
[INFO] Running jmri.jmrix.marklin.networkdriver.configurexml.ConnectionConfigXmlTest
[INFO] Tests run: 4, Failures: 0, Errors: 0, Skipped: 0, Time elapsed: 0.015 s - in jmri.jmrix.marklin.networkdriver.configurexml.ConnectionConfigXmlTest
[INFO] Running jmri.jmrix.marklin.networkdriver.NetworkDriverAdapterTest
[INFO] Tests run: 1, Failures: 0, Errors: 0, Skipped: 0, Time elapsed: 0.001 s - in jmri.jmrix.marklin.networkdriver.NetworkDriverAdapterTest
[INFO] Running jmri.jmrix.rfid.configurexml.RfidReporterManagerXmlTest
[INFO] Tests run: 1, Failures: 0, Errors: 0, Skipped: 0, Time elapsed: 0 s - in jmri.jmrix.rfid.configurexml.RfidReporterManagerXmlTest
[INFO] Running jmri.jmrix.rfid.configurexml.RfidSensorManagerXmlTest
[INFO] Tests run: 1, Failures: 0, Errors: 0, Skipped: 0, Time elapsed: 0 s - in jmri.jmrix.rfid.configurexml.RfidSensorManagerXmlTest
[INFO] Running jmri.jmrix.rfid.configurexml.RfidStreamConnectionConfigXmlTest
[INFO] Tests run: 4, Failures: 0, Errors: 0, Skipped: 0, Time elapsed: 0.037 s - in jmri.jmrix.rfid.configurexml.RfidStreamConnectionConfigXmlTest
[INFO] Running jmri.jmrix.rfid.RfidStreamPortControllerTest
[INFO] Tests run: 2, Failures: 0, Errors: 0, Skipped: 0, Time elapsed: 0.001 s - in jmri.jmrix.rfid.RfidStreamPortControllerTest
[INFO] Running jmri.jmrix.rfid.serialdriver.ConnectionConfigTest
[WARNING] Tests run: 8, Failures: 0, Errors: 0, Skipped: 5, Time elapsed: 0.035 s - in jmri.jmrix.rfid.serialdriver.ConnectionConfigTest
[INFO] Running jmri.jmrix.rfid.serialdriver.configurexml.ConnectionConfigXmlTest
[INFO] Tests run: 4, Failures: 0, Errors: 0, Skipped: 0, Time elapsed: 0.036 s - in jmri.jmrix.rfid.serialdriver.configurexml.ConnectionConfigXmlTest
[INFO] Running jmri.jmrix.rfid.serialdriver.BundleTest
[INFO] Tests run: 2, Failures: 0, Errors: 0, Skipped: 0, Time elapsed: 0 s - in jmri.jmrix.rfid.serialdriver.BundleTest
[INFO] Running jmri.jmrix.rfid.serialdriver.SerialDriverAdapterTest
[INFO] Tests run: 1, Failures: 0, Errors: 0, Skipped: 0, Time elapsed: 0.001 s - in jmri.jmrix.rfid.serialdriver.SerialDriverAdapterTest
[INFO] Running jmri.jmrix.rfid.TimeoutRfidReporterTest
[INFO] Tests run: 6, Failures: 0, Errors: 0, Skipped: 0, Time elapsed: 0.021 s - in jmri.jmrix.rfid.TimeoutRfidReporterTest
[INFO] Running jmri.jmrix.rfid.swing.BundleTest
[INFO] Tests run: 2, Failures: 0, Errors: 0, Skipped: 0, Time elapsed: 0 s - in jmri.jmrix.rfid.swing.BundleTest
[INFO] Running jmri.jmrix.rfid.swing.serialmon.SerialMonPaneTest
[INFO] Tests run: 13, Failures: 0, Errors: 0, Skipped: 0, Time elapsed: 4.013 s - in jmri.jmrix.rfid.swing.serialmon.SerialMonPaneTest
[INFO] Running jmri.jmrix.rfid.swing.serialmon.BundleTest
[INFO] Tests run: 2, Failures: 0, Errors: 0, Skipped: 0, Time elapsed: 0 s - in jmri.jmrix.rfid.swing.serialmon.BundleTest
[INFO] Running jmri.jmrix.rfid.swing.RfidComponentFactoryTest
[INFO] Tests run: 3, Failures: 0, Errors: 0, Skipped: 0, Time elapsed: 0.006 s - in jmri.jmrix.rfid.swing.RfidComponentFactoryTest
[INFO] Running jmri.jmrix.rfid.swing.RfidMenuTest
[INFO] Tests run: 1, Failures: 0, Errors: 0, Skipped: 0, Time elapsed: 0.001 s - in jmri.jmrix.rfid.swing.RfidMenuTest
[INFO] Running jmri.jmrix.rfid.swing.RfidPanelTest
[INFO] Tests run: 1, Failures: 0, Errors: 0, Skipped: 0, Time elapsed: 0.002 s - in jmri.jmrix.rfid.swing.RfidPanelTest
[INFO] Running jmri.jmrix.rfid.swing.RfidNamedPaneActionTest
[INFO] Tests run: 1, Failures: 0, Errors: 0, Skipped: 0, Time elapsed: 0.009 s - in jmri.jmrix.rfid.swing.RfidNamedPaneActionTest
[INFO] Running jmri.jmrix.rfid.RfidStreamConnectionConfigTest
[WARNING] Tests run: 8, Failures: 0, Errors: 0, Skipped: 5, Time elapsed: 0.011 s - in jmri.jmrix.rfid.RfidStreamConnectionConfigTest
[INFO] Running jmri.jmrix.rfid.RfidMessageTest
[INFO] Tests run: 3, Failures: 0, Errors: 0, Skipped: 0, Time elapsed: 0.001 s - in jmri.jmrix.rfid.RfidMessageTest
[INFO] Running jmri.jmrix.rfid.RfidPortControllerTest
[INFO] Tests run: 1, Failures: 0, Errors: 0, Skipped: 0, Time elapsed: 0 s - in jmri.jmrix.rfid.RfidPortControllerTest
[INFO] Running jmri.jmrix.rfid.BundleTest
[INFO] Tests run: 2, Failures: 0, Errors: 0, Skipped: 0, Time elapsed: 0 s - in jmri.jmrix.rfid.BundleTest
[INFO] Running jmri.jmrix.rfid.RfidTrafficControllerTest
[INFO] Tests run: 6, Failures: 0, Errors: 0, Skipped: 0, Time elapsed: 0.002 s - in jmri.jmrix.rfid.RfidTrafficControllerTest
[INFO] Running jmri.jmrix.rfid.RfidReporterManagerTest
[WARNING] Tests run: 21, Failures: 0, Errors: 0, Skipped: 2, Time elapsed: 0.028 s - in jmri.jmrix.rfid.RfidReporterManagerTest
[INFO] Running jmri.jmrix.rfid.generic.standalone.configurexml.StandaloneSensorManagerXmlTest
[INFO] Tests run: 1, Failures: 0, Errors: 0, Skipped: 0, Time elapsed: 0 s - in jmri.jmrix.rfid.generic.standalone.configurexml.StandaloneSensorManagerXmlTest
[INFO] Running jmri.jmrix.rfid.generic.standalone.configurexml.StandaloneReporterManagerXmlTest
[INFO] Tests run: 1, Failures: 0, Errors: 0, Skipped: 0, Time elapsed: 0 s - in jmri.jmrix.rfid.generic.standalone.configurexml.StandaloneReporterManagerXmlTest
[INFO] Running jmri.jmrix.rfid.generic.standalone.StandaloneSystemConnectionMemoTest
[INFO] Tests run: 10, Failures: 0, Errors: 0, Skipped: 0, Time elapsed: 0.014 s - in jmri.jmrix.rfid.generic.standalone.StandaloneSystemConnectionMemoTest
[INFO] Running jmri.jmrix.rfid.generic.standalone.StandaloneSensorManagerTest
[WARNING] Tests run: 22, Failures: 0, Errors: 0, Skipped: 1, Time elapsed: 0.031 s - in jmri.jmrix.rfid.generic.standalone.StandaloneSensorManagerTest
[INFO] Running jmri.jmrix.rfid.generic.standalone.StandaloneMessageTest
[INFO] Tests run: 3, Failures: 0, Errors: 0, Skipped: 0, Time elapsed: 0.001 s - in jmri.jmrix.rfid.generic.standalone.StandaloneMessageTest
[INFO] Running jmri.jmrix.rfid.generic.standalone.StandaloneTrafficControllerTest
[INFO] Tests run: 6, Failures: 0, Errors: 0, Skipped: 0, Time elapsed: 0.007 s - in jmri.jmrix.rfid.generic.standalone.StandaloneTrafficControllerTest
[INFO] Running jmri.jmrix.rfid.generic.standalone.StandaloneReplyTest
[INFO] Tests run: 3, Failures: 0, Errors: 0, Skipped: 0, Time elapsed: 0.003 s - in jmri.jmrix.rfid.generic.standalone.StandaloneReplyTest
[INFO] Running jmri.jmrix.rfid.generic.standalone.StandaloneReporterManagerTest
[WARNING] Tests run: 21, Failures: 0, Errors: 0, Skipped: 2, Time elapsed: 0.029 s - in jmri.jmrix.rfid.generic.standalone.StandaloneReporterManagerTest
[INFO] Running jmri.jmrix.rfid.RfidNetworkPortControllerTest
[INFO] Tests run: 1, Failures: 0, Errors: 0, Skipped: 0, Time elapsed: 0.001 s - in jmri.jmrix.rfid.RfidNetworkPortControllerTest
[INFO] Running jmri.jmrix.rfid.RfidSensorManagerTest
[INFO] Tests run: 1, Failures: 0, Errors: 0, Skipped: 0, Time elapsed: 0.002 s - in jmri.jmrix.rfid.RfidSensorManagerTest
[INFO] Running jmri.jmrix.rfid.RfidReporterTest
[INFO] Tests run: 6, Failures: 0, Errors: 0, Skipped: 0, Time elapsed: 0.006 s - in jmri.jmrix.rfid.RfidReporterTest
[INFO] Running jmri.jmrix.rfid.protocol.parallax.ParallaxRfidProtocolTest
[INFO] Tests run: 9, Failures: 0, Errors: 0, Skipped: 0, Time elapsed: 0.002 s - in jmri.jmrix.rfid.protocol.parallax.ParallaxRfidProtocolTest
[INFO] Running jmri.jmrix.rfid.protocol.seeedstudio.SeeedStudioRfidProtocolTest
[INFO] Tests run: 10, Failures: 0, Errors: 0, Skipped: 0, Time elapsed: 0.003 s - in jmri.jmrix.rfid.protocol.seeedstudio.SeeedStudioRfidProtocolTest
[INFO] Running jmri.jmrix.rfid.protocol.coreid.CoreIdRfidProtocolTest
[INFO] Tests run: 10, Failures: 0, Errors: 0, Skipped: 0, Time elapsed: 0.002 s - in jmri.jmrix.rfid.protocol.coreid.CoreIdRfidProtocolTest
[INFO] Running jmri.jmrix.rfid.protocol.olimex.OlimexRfid1356mifareProtocolTest
[INFO] Tests run: 9, Failures: 0, Errors: 0, Skipped: 0, Time elapsed: 0.003 s - in jmri.jmrix.rfid.protocol.olimex.OlimexRfid1356mifareProtocolTest
[INFO] Running jmri.jmrix.rfid.protocol.olimex.OlimexRfidProtocolTest
[INFO] Tests run: 9, Failures: 0, Errors: 0, Skipped: 0, Time elapsed: 0.008 s - in jmri.jmrix.rfid.protocol.olimex.OlimexRfidProtocolTest
[INFO] Running jmri.jmrix.rfid.protocol.em18.Em18RfidProtocolTest
[INFO] Tests run: 10, Failures: 0, Errors: 0, Skipped: 0, Time elapsed: 0.001 s - in jmri.jmrix.rfid.protocol.em18.Em18RfidProtocolTest
[INFO] Running jmri.jmrix.rfid.RfidConnectionTypeListTest
[INFO] Tests run: 1, Failures: 0, Errors: 0, Skipped: 0, Time elapsed: 0 s - in jmri.jmrix.rfid.RfidConnectionTypeListTest
[INFO] Running jmri.jmrix.rfid.merg.concentrator.configurexml.ConcentratorReporterManagerXmlTest
[INFO] Tests run: 1, Failures: 0, Errors: 0, Skipped: 0, Time elapsed: 0 s - in jmri.jmrix.rfid.merg.concentrator.configurexml.ConcentratorReporterManagerXmlTest
[INFO] Running jmri.jmrix.rfid.merg.concentrator.configurexml.ConcentratorSensorManagerXmlTest
[INFO] Tests run: 1, Failures: 0, Errors: 0, Skipped: 0, Time elapsed: 0 s - in jmri.jmrix.rfid.merg.concentrator.configurexml.ConcentratorSensorManagerXmlTest
[INFO] Running jmri.jmrix.rfid.merg.concentrator.ConcentratorReplyTest
[INFO] Tests run: 3, Failures: 0, Errors: 0, Skipped: 0, Time elapsed: 0.002 s - in jmri.jmrix.rfid.merg.concentrator.ConcentratorReplyTest
[INFO] Running jmri.jmrix.rfid.merg.concentrator.ConcentratorSystemConnectionMemoTest
[INFO] Tests run: 10, Failures: 0, Errors: 0, Skipped: 0, Time elapsed: 0.013 s - in jmri.jmrix.rfid.merg.concentrator.ConcentratorSystemConnectionMemoTest
[INFO] Running jmri.jmrix.rfid.merg.concentrator.ConcentratorSensorManagerTest
[WARNING] Tests run: 22, Failures: 0, Errors: 0, Skipped: 1, Time elapsed: 0.031 s - in jmri.jmrix.rfid.merg.concentrator.ConcentratorSensorManagerTest
[INFO] Running jmri.jmrix.rfid.merg.concentrator.ConcentratorMessageTest
[INFO] Tests run: 3, Failures: 0, Errors: 0, Skipped: 0, Time elapsed: 0 s - in jmri.jmrix.rfid.merg.concentrator.ConcentratorMessageTest
[INFO] Running jmri.jmrix.rfid.merg.concentrator.ConcentratorTrafficControllerTest
[INFO] Tests run: 6, Failures: 0, Errors: 0, Skipped: 0, Time elapsed: 0.025 s - in jmri.jmrix.rfid.merg.concentrator.ConcentratorTrafficControllerTest
[INFO] Running jmri.jmrix.rfid.merg.concentrator.ConcentratorReporterManagerTest
[WARNING] Tests run: 21, Failures: 0, Errors: 0, Skipped: 2, Time elapsed: 0.011 s - in jmri.jmrix.rfid.merg.concentrator.ConcentratorReporterManagerTest
[INFO] Running jmri.jmrix.rfid.RfidReplyTest
[INFO] Tests run: 3, Failures: 0, Errors: 0, Skipped: 0, Time elapsed: 0.001 s - in jmri.jmrix.rfid.RfidReplyTest
[INFO] Running jmri.jmrix.rfid.networkdriver.ConnectionConfigTest
[WARNING] Tests run: 8, Failures: 0, Errors: 0, Skipped: 5, Time elapsed: 0.019 s - in jmri.jmrix.rfid.networkdriver.ConnectionConfigTest
[INFO] Running jmri.jmrix.rfid.networkdriver.configurexml.ConnectionConfigXmlTest
[INFO] Tests run: 4, Failures: 0, Errors: 0, Skipped: 0, Time elapsed: 0.024 s - in jmri.jmrix.rfid.networkdriver.configurexml.ConnectionConfigXmlTest
[INFO] Running jmri.jmrix.rfid.networkdriver.BundleTest
[INFO] Tests run: 2, Failures: 0, Errors: 0, Skipped: 0, Time elapsed: 0 s - in jmri.jmrix.rfid.networkdriver.BundleTest
[INFO] Running jmri.jmrix.rfid.networkdriver.NetworkDriverAdapterTest
[INFO] Tests run: 1, Failures: 0, Errors: 0, Skipped: 0, Time elapsed: 0 s - in jmri.jmrix.rfid.networkdriver.NetworkDriverAdapterTest
[INFO] Running jmri.jmrix.rfid.RfidSensorTest
[INFO] Tests run: 15, Failures: 0, Errors: 0, Skipped: 0, Time elapsed: 0.125 s - in jmri.jmrix.rfid.RfidSensorTest
[INFO] Running jmri.jmrix.rfid.TimeoutRfidSensorTest
[INFO] Tests run: 15, Failures: 0, Errors: 0, Skipped: 0, Time elapsed: 0.125 s - in jmri.jmrix.rfid.TimeoutRfidSensorTest
[INFO] Running jmri.jmrix.rfid.RfidSystemConnectionMemoTest
[INFO] Tests run: 10, Failures: 0, Errors: 0, Skipped: 0, Time elapsed: 0.013 s - in jmri.jmrix.rfid.RfidSystemConnectionMemoTest
[INFO] Running jmri.jmrix.serialsensor.BundleTest
[INFO] Tests run: 2, Failures: 0, Errors: 0, Skipped: 0, Time elapsed: 0 s - in jmri.jmrix.serialsensor.BundleTest
[INFO] Running jmri.jmrix.serialsensor.SerialSensorAdapterTest
[INFO] Tests run: 1, Failures: 0, Errors: 0, Skipped: 0, Time elapsed: 0.004 s - in jmri.jmrix.serialsensor.SerialSensorAdapterTest
[INFO] Running jmri.jmrix.loconet.hexfile.ConnectionConfigTest
[WARNING] Tests run: 8, Failures: 0, Errors: 0, Skipped: 5, Time elapsed: 0.023 s - in jmri.jmrix.loconet.hexfile.ConnectionConfigTest
[INFO] Running jmri.jmrix.loconet.hexfile.configurexml.ConnectionConfigXmlTest
[INFO] Tests run: 4, Failures: 0, Errors: 0, Skipped: 0, Time elapsed: 0.113 s - in jmri.jmrix.loconet.hexfile.configurexml.ConnectionConfigXmlTest
[INFO] Running jmri.jmrix.loconet.hexfile.configurexml.LnSensorManagerXmlTest
[INFO] Tests run: 1, Failures: 0, Errors: 0, Skipped: 0, Time elapsed: 0.001 s - in jmri.jmrix.loconet.hexfile.configurexml.LnSensorManagerXmlTest
[INFO] Running jmri.jmrix.loconet.hexfile.HexFileSystemConnectionMemoTest
[INFO] Tests run: 10, Failures: 0, Errors: 0, Skipped: 0, Time elapsed: 0.091 s - in jmri.jmrix.loconet.hexfile.HexFileSystemConnectionMemoTest
[INFO] Running jmri.jmrix.loconet.hexfile.BundleTest
[INFO] Tests run: 6, Failures: 0, Errors: 0, Skipped: 0, Time elapsed: 0.009 s - in jmri.jmrix.loconet.hexfile.BundleTest
[INFO] Running jmri.jmrix.loconet.hexfile.LnHexFileActionTest
[INFO] Tests run: 1, Failures: 0, Errors: 0, Skipped: 0, Time elapsed: 0.001 s - in jmri.jmrix.loconet.hexfile.LnHexFileActionTest
[INFO] Running jmri.jmrix.loconet.hexfile.HexFileFrameTest
[INFO] Tests run: 1, Failures: 0, Errors: 0, Skipped: 0, Time elapsed: 0.076 s - in jmri.jmrix.loconet.hexfile.HexFileFrameTest
[INFO] Running jmri.jmrix.loconet.hexfile.HexFileServerTest
[INFO] Tests run: 1, Failures: 0, Errors: 0, Skipped: 0, Time elapsed: 0.001 s - in jmri.jmrix.loconet.hexfile.HexFileServerTest
[INFO] Running jmri.jmrix.loconet.hexfile.LnHexFilePortTest
[INFO] Tests run: 1, Failures: 0, Errors: 0, Skipped: 0, Time elapsed: 0.001 s - in jmri.jmrix.loconet.hexfile.LnHexFilePortTest
[INFO] Running jmri.jmrix.loconet.hexfile.LnSensorManagerTest
[WARNING] Tests run: 25, Failures: 0, Errors: 0, Skipped: 1, Time elapsed: 0.072 s - in jmri.jmrix.loconet.hexfile.LnSensorManagerTest
[INFO] Running jmri.jmrix.loconet.sdfeditor.GenerateTriggerEditorTest
[INFO] Tests run: 1, Failures: 0, Errors: 0, Skipped: 0, Time elapsed: 0.017 s - in jmri.jmrix.loconet.sdfeditor.GenerateTriggerEditorTest
[INFO] Running jmri.jmrix.loconet.sdfeditor.EditorFrameTest
[INFO] Tests run: 2, Failures: 0, Errors: 0, Skipped: 0, Time elapsed: 2.857 s - in jmri.jmrix.loconet.sdfeditor.EditorFrameTest
[INFO] Running jmri.jmrix.loconet.sdfeditor.MonitoringLabelTest
[INFO] Tests run: 1, Failures: 0, Errors: 0, Skipped: 0, Time elapsed: 0.009 s - in jmri.jmrix.loconet.sdfeditor.MonitoringLabelTest
[INFO] Running jmri.jmrix.loconet.sdfeditor.DelaySoundEditorTest
[INFO] Tests run: 1, Failures: 0, Errors: 0, Skipped: 0, Time elapsed: 0 s - in jmri.jmrix.loconet.sdfeditor.DelaySoundEditorTest
[INFO] Running jmri.jmrix.loconet.sdfeditor.BundleTest
[INFO] Tests run: 6, Failures: 0, Errors: 0, Skipped: 0, Time elapsed: 0 s - in jmri.jmrix.loconet.sdfeditor.BundleTest
[INFO] Running jmri.jmrix.loconet.sdfeditor.CommentMacroEditorTest
[INFO] Tests run: 1, Failures: 0, Errors: 0, Skipped: 0, Time elapsed: 0 s - in jmri.jmrix.loconet.sdfeditor.CommentMacroEditorTest
[INFO] Running jmri.jmrix.loconet.sdfeditor.TwoByteMacroEditorTest
[INFO] Tests run: 1, Failures: 0, Errors: 0, Skipped: 0, Time elapsed: 0 s - in jmri.jmrix.loconet.sdfeditor.TwoByteMacroEditorTest
[INFO] Running jmri.jmrix.loconet.sdfeditor.EditorPaneTest
[INFO] Tests run: 1, Failures: 0, Errors: 0, Skipped: 0, Time elapsed: 1.228 s - in jmri.jmrix.loconet.sdfeditor.EditorPaneTest
[INFO] Running jmri.jmrix.loconet.sdfeditor.BranchToEditorTest
[INFO] Tests run: 1, Failures: 0, Errors: 0, Skipped: 0, Time elapsed: 0 s - in jmri.jmrix.loconet.sdfeditor.BranchToEditorTest
[INFO] Running jmri.jmrix.loconet.sdfeditor.EndSoundEditorTest
[INFO] Tests run: 1, Failures: 0, Errors: 0, Skipped: 0, Time elapsed: 0 s - in jmri.jmrix.loconet.sdfeditor.EndSoundEditorTest
[INFO] Running jmri.jmrix.loconet.sdfeditor.PlayEditorTest
[INFO] Tests run: 1, Failures: 0, Errors: 0, Skipped: 0, Time elapsed: 0 s - in jmri.jmrix.loconet.sdfeditor.PlayEditorTest
[INFO] Running jmri.jmrix.loconet.sdfeditor.LoadModifierEditorTest
[INFO] Tests run: 1, Failures: 0, Errors: 0, Skipped: 0, Time elapsed: 0 s - in jmri.jmrix.loconet.sdfeditor.LoadModifierEditorTest
[INFO] Running jmri.jmrix.loconet.sdfeditor.ChannelStartEditorTest
[INFO] Tests run: 1, Failures: 0, Errors: 0, Skipped: 0, Time elapsed: 0 s - in jmri.jmrix.loconet.sdfeditor.ChannelStartEditorTest
[INFO] Running jmri.jmrix.loconet.sdfeditor.SkipOnTriggerEditorTest
[INFO] Tests run: 1, Failures: 0, Errors: 0, Skipped: 0, Time elapsed: 0 s - in jmri.jmrix.loconet.sdfeditor.SkipOnTriggerEditorTest
[INFO] Running jmri.jmrix.loconet.sdfeditor.SdlVersionEditorTest
[INFO] Tests run: 1, Failures: 0, Errors: 0, Skipped: 0, Time elapsed: 0 s - in jmri.jmrix.loconet.sdfeditor.SdlVersionEditorTest
[INFO] Running jmri.jmrix.loconet.sdfeditor.FourByteMacroEditorTest
[INFO] Tests run: 1, Failures: 0, Errors: 0, Skipped: 0, Time elapsed: 0 s - in jmri.jmrix.loconet.sdfeditor.FourByteMacroEditorTest
[INFO] Running jmri.jmrix.loconet.sdfeditor.InitiateSoundEditorTest
[INFO] Tests run: 1, Failures: 0, Errors: 0, Skipped: 0, Time elapsed: 0 s - in jmri.jmrix.loconet.sdfeditor.InitiateSoundEditorTest
[INFO] Running jmri.jmrix.loconet.sdfeditor.MaskCompareEditorTest
[INFO] Tests run: 1, Failures: 0, Errors: 0, Skipped: 0, Time elapsed: 0 s - in jmri.jmrix.loconet.sdfeditor.MaskCompareEditorTest
[INFO] Running jmri.jmrix.loconet.sdfeditor.SkemeStartEditorTest
[INFO] Tests run: 1, Failures: 0, Errors: 0, Skipped: 0, Time elapsed: 0 s - in jmri.jmrix.loconet.sdfeditor.SkemeStartEditorTest
[INFO] Running jmri.jmrix.loconet.sdfeditor.LabelMacroEditorTest
[INFO] Tests run: 1, Failures: 0, Errors: 0, Skipped: 0, Time elapsed: 0 s - in jmri.jmrix.loconet.sdfeditor.LabelMacroEditorTest
[INFO] Running jmri.jmrix.loconet.bluetooth.ConnectionConfigTest
BlueCove log redirected to log4j
[WARNING] Tests run: 8, Failures: 0, Errors: 0, Skipped: 5, Time elapsed: 0.086 s - in jmri.jmrix.loconet.bluetooth.ConnectionConfigTest
[INFO] Running jmri.jmrix.loconet.bluetooth.configurexml.ConnectionConfigXmlTest
[WARNING] Tests run: 4, Failures: 0, Errors: 0, Skipped: 2, Time elapsed: 0.004 s - in jmri.jmrix.loconet.bluetooth.configurexml.ConnectionConfigXmlTest
[INFO] Running jmri.jmrix.loconet.bluetooth.BundleTest
[INFO] Tests run: 6, Failures: 0, Errors: 0, Skipped: 0, Time elapsed: 0.001 s - in jmri.jmrix.loconet.bluetooth.BundleTest
[INFO] Running jmri.jmrix.loconet.bluetooth.LocoNetBluetoothAdapterTest
[INFO] Tests run: 1, Failures: 0, Errors: 0, Skipped: 0, Time elapsed: 0 s - in jmri.jmrix.loconet.bluetooth.LocoNetBluetoothAdapterTest
[INFO] Running jmri.jmrix.loconet.LNCPSignalMastTest
[INFO] Tests run: 1, Failures: 0, Errors: 0, Skipped: 0, Time elapsed: 0.044 s - in jmri.jmrix.loconet.LNCPSignalMastTest
[INFO] Running jmri.jmrix.loconet.LnThrottleManagerTest
[WARNING] Tests run: 30, Failures: 0, Errors: 0, Skipped: 1, Time elapsed: 0.392 s - in jmri.jmrix.loconet.LnThrottleManagerTest
[INFO] Running jmri.jmrix.loconet.LnSensorTest
[INFO] Tests run: 15, Failures: 0, Errors: 0, Skipped: 0, Time elapsed: 0.124 s - in jmri.jmrix.loconet.LnSensorTest
[INFO] Running jmri.jmrix.loconet.configurexml.LnLightManagerXmlTest
[INFO] Tests run: 1, Failures: 0, Errors: 0, Skipped: 0, Time elapsed: 0.001 s - in jmri.jmrix.loconet.configurexml.LnLightManagerXmlTest
[INFO] Running jmri.jmrix.loconet.configurexml.SE8cSignalHeadXmlTest
[INFO] Tests run: 1, Failures: 0, Errors: 0, Skipped: 0, Time elapsed: 0 s - in jmri.jmrix.loconet.configurexml.SE8cSignalHeadXmlTest
[INFO] Running jmri.jmrix.loconet.configurexml.LoadAndStoreTest
[INFO] Tests run: 2, Failures: 0, Errors: 0, Skipped: 0, Time elapsed: 0.876 s - in jmri.jmrix.loconet.configurexml.LoadAndStoreTest
[INFO] Running jmri.jmrix.loconet.configurexml.LnTurnoutManagerXmlTest
[INFO] Tests run: 2, Failures: 0, Errors: 0, Skipped: 0, Time elapsed: 0.016 s - in jmri.jmrix.loconet.configurexml.LnTurnoutManagerXmlTest
[INFO] Running jmri.jmrix.loconet.configurexml.LnReporterManagerXmlTest
[INFO] Tests run: 1, Failures: 0, Errors: 0, Skipped: 0, Time elapsed: 0 s - in jmri.jmrix.loconet.configurexml.LnReporterManagerXmlTest
[INFO] Running jmri.jmrix.loconet.configurexml.LNCPSignalMastXmlTest
[INFO] Tests run: 1, Failures: 0, Errors: 0, Skipped: 0, Time elapsed: 0.001 s - in jmri.jmrix.loconet.configurexml.LNCPSignalMastXmlTest
[INFO] Running jmri.jmrix.loconet.configurexml.LnSensorManagerXmlTest
[INFO] Tests run: 1, Failures: 0, Errors: 0, Skipped: 0, Time elapsed: 0 s - in jmri.jmrix.loconet.configurexml.LnSensorManagerXmlTest
[INFO] Running jmri.jmrix.loconet.locobufferii.ConnectionConfigTest
[WARNING] Tests run: 8, Failures: 0, Errors: 0, Skipped: 5, Time elapsed: 0.033 s - in jmri.jmrix.loconet.locobufferii.ConnectionConfigTest
[INFO] Running jmri.jmrix.loconet.locobufferii.configurexml.ConnectionConfigXmlTest
[INFO] Tests run: 4, Failures: 0, Errors: 0, Skipped: 0, Time elapsed: 0.045 s - in jmri.jmrix.loconet.locobufferii.configurexml.ConnectionConfigXmlTest
[INFO] Running jmri.jmrix.loconet.locobufferii.BundleTest
[INFO] Tests run: 6, Failures: 0, Errors: 0, Skipped: 0, Time elapsed: 0 s - in jmri.jmrix.loconet.locobufferii.BundleTest
[INFO] Running jmri.jmrix.loconet.locobufferii.LocoBufferIIAdapterTest
[INFO] Tests run: 1, Failures: 0, Errors: 0, Skipped: 0, Time elapsed: 0 s - in jmri.jmrix.loconet.locobufferii.LocoBufferIIAdapterTest
[INFO] Running jmri.jmrix.loconet.LnPr2ThrottleManagerTest
[INFO] Tests run: 17, Failures: 0, Errors: 0, Skipped: 0, Time elapsed: 0.029 s - in jmri.jmrix.loconet.LnPr2ThrottleManagerTest
[INFO] Running jmri.jmrix.loconet.CsOpSwAccessTest
[INFO] Tests run: 7, Failures: 0, Errors: 0, Skipped: 0, Time elapsed: 0.531 s - in jmri.jmrix.loconet.CsOpSwAccessTest
[INFO] Running jmri.jmrix.loconet.swing.throttlemsg.BundleTest
[INFO] Tests run: 6, Failures: 0, Errors: 0, Skipped: 0, Time elapsed: 0.001 s - in jmri.jmrix.loconet.swing.throttlemsg.BundleTest
[INFO] Running jmri.jmrix.loconet.swing.throttlemsg.MessagePanelTest
[INFO] Tests run: 4, Failures: 0, Errors: 0, Skipped: 0, Time elapsed: 0.009 s - in jmri.jmrix.loconet.swing.throttlemsg.MessagePanelTest
[INFO] Running jmri.jmrix.loconet.swing.LnComponentFactoryTest
[INFO] Tests run: 1, Failures: 0, Errors: 0, Skipped: 0, Time elapsed: 0.001 s - in jmri.jmrix.loconet.swing.LnComponentFactoryTest
[INFO] Running jmri.jmrix.loconet.swing.BundleTest
[INFO] Tests run: 6, Failures: 0, Errors: 0, Skipped: 0, Time elapsed: 0 s - in jmri.jmrix.loconet.swing.BundleTest
[INFO] Running jmri.jmrix.loconet.swing.LnNamedPaneActionTest
[INFO] Tests run: 1, Failures: 0, Errors: 0, Skipped: 0, Time elapsed: 0.009 s - in jmri.jmrix.loconet.swing.LnNamedPaneActionTest
[INFO] Running jmri.jmrix.loconet.swing.LocoNetMenuTest
[INFO] Tests run: 1, Failures: 0, Errors: 0, Skipped: 0, Time elapsed: 0.005 s - in jmri.jmrix.loconet.swing.LocoNetMenuTest
[INFO] Running jmri.jmrix.loconet.usb_dcs52.ConnectionConfigTest
[WARNING] Tests run: 8, Failures: 0, Errors: 0, Skipped: 5, Time elapsed: 0.038 s - in jmri.jmrix.loconet.usb_dcs52.ConnectionConfigTest
[INFO] Running jmri.jmrix.loconet.usb_dcs52.configurexml.ConnectionConfigXmlTest
[INFO] Tests run: 4, Failures: 0, Errors: 0, Skipped: 0, Time elapsed: 0.034 s - in jmri.jmrix.loconet.usb_dcs52.configurexml.ConnectionConfigXmlTest
[INFO] Running jmri.jmrix.loconet.usb_dcs52.swing.BundleTest
[INFO] Tests run: 6, Failures: 0, Errors: 0, Skipped: 0, Time elapsed: 0.004 s - in jmri.jmrix.loconet.usb_dcs52.swing.BundleTest
[INFO] Running jmri.jmrix.loconet.usb_dcs52.swing.Dcs52UsbModeSelectPaneTest
[INFO] Tests run: 4, Failures: 0, Errors: 0, Skipped: 0, Time elapsed: 0.011 s - in jmri.jmrix.loconet.usb_dcs52.swing.Dcs52UsbModeSelectPaneTest
[INFO] Running jmri.jmrix.loconet.usb_dcs52.BundleTest
[INFO] Tests run: 6, Failures: 0, Errors: 0, Skipped: 0, Time elapsed: 0.001 s - in jmri.jmrix.loconet.usb_dcs52.BundleTest
[INFO] Running jmri.jmrix.loconet.usb_dcs52.UsbDcs52AdapterTest
[INFO] Tests run: 1, Failures: 0, Errors: 0, Skipped: 0, Time elapsed: 0 s - in jmri.jmrix.loconet.usb_dcs52.UsbDcs52AdapterTest
[INFO] Running jmri.jmrix.loconet.usb_dcs52.UsbDcs52SystemConnectionMemoTest
[INFO] Tests run: 10, Failures: 0, Errors: 0, Skipped: 0, Time elapsed: 0.024 s - in jmri.jmrix.loconet.usb_dcs52.UsbDcs52SystemConnectionMemoTest
[INFO] Running jmri.jmrix.loconet.UhlenbrockSlotTest
[INFO] Tests run: 1, Failures: 0, Errors: 0, Skipped: 0, Time elapsed: 0 s - in jmri.jmrix.loconet.UhlenbrockSlotTest
[INFO] Running jmri.jmrix.loconet.TranspondingTagManagerTest
[INFO] Tests run: 13, Failures: 0, Errors: 0, Skipped: 0, Time elapsed: 0.04 s - in jmri.jmrix.loconet.TranspondingTagManagerTest
[INFO] Running jmri.jmrix.loconet.ms100.ConnectionConfigTest
[WARNING] Tests run: 8, Failures: 0, Errors: 0, Skipped: 5, Time elapsed: 0.03 s - in jmri.jmrix.loconet.ms100.ConnectionConfigTest
[INFO] Running jmri.jmrix.loconet.ms100.configurexml.ConnectionConfigXmlTest
[INFO] Tests run: 4, Failures: 0, Errors: 0, Skipped: 0, Time elapsed: 0.033 s - in jmri.jmrix.loconet.ms100.configurexml.ConnectionConfigXmlTest
[INFO] Running jmri.jmrix.loconet.ms100.BundleTest
[INFO] Tests run: 6, Failures: 0, Errors: 0, Skipped: 0, Time elapsed: 0.001 s - in jmri.jmrix.loconet.ms100.BundleTest
[INFO] Running jmri.jmrix.loconet.ms100.MS100AdapterTest
[INFO] Tests run: 1, Failures: 0, Errors: 0, Skipped: 0, Time elapsed: 0 s - in jmri.jmrix.loconet.ms100.MS100AdapterTest
[INFO] Running jmri.jmrix.loconet.LnTrafficControllerTest
[INFO] Tests run: 1, Failures: 0, Errors: 0, Skipped: 0, Time elapsed: 0 s - in jmri.jmrix.loconet.LnTrafficControllerTest
[INFO] Running jmri.jmrix.loconet.LocoNetSlotTest
[INFO] Tests run: 51, Failures: 0, Errors: 0, Skipped: 0, Time elapsed: 0.04 s - in jmri.jmrix.loconet.LocoNetSlotTest
[INFO] Running jmri.jmrix.loconet.LnMultiMeterTest
[INFO] Tests run: 1, Failures: 0, Errors: 0, Skipped: 0, Time elapsed: 0 s - in jmri.jmrix.loconet.LnMultiMeterTest
[INFO] Running jmri.jmrix.loconet.Ib2ThrottleManagerTest
[WARNING] Tests run: 16, Failures: 0, Errors: 0, Skipped: 1, Time elapsed: 0.022 s - in jmri.jmrix.loconet.Ib2ThrottleManagerTest
[INFO] Running jmri.jmrix.loconet.locostats.swing.LocoStatsPanelTest
[INFO] Tests run: 4, Failures: 0, Errors: 0, Skipped: 0, Time elapsed: 0.014 s - in jmri.jmrix.loconet.locostats.swing.LocoStatsPanelTest
[INFO] Running jmri.jmrix.loconet.locostats.swing.LocoStatsFrameTest
[INFO] Tests run: 4, Failures: 0, Errors: 0, Skipped: 0, Time elapsed: 0.096 s - in jmri.jmrix.loconet.locostats.swing.LocoStatsFrameTest
[INFO] Running jmri.jmrix.loconet.locostats.swing.BundleTest
[INFO] Tests run: 6, Failures: 0, Errors: 0, Skipped: 0, Time elapsed: 0.003 s - in jmri.jmrix.loconet.locostats.swing.BundleTest
[INFO] Running jmri.jmrix.loconet.locostats.BundleTest
[INFO] Tests run: 6, Failures: 0, Errors: 0, Skipped: 0, Time elapsed: 0.001 s - in jmri.jmrix.loconet.locostats.BundleTest
[INFO] Running jmri.jmrix.loconet.locostats.RawStatusTest
[INFO] Tests run: 1, Failures: 0, Errors: 0, Skipped: 0, Time elapsed: 0 s - in jmri.jmrix.loconet.locostats.RawStatusTest
[INFO] Running jmri.jmrix.loconet.locostats.PR3MS100ModeStatusTest
[INFO] Tests run: 1, Failures: 0, Errors: 0, Skipped: 0, Time elapsed: 0 s - in jmri.jmrix.loconet.locostats.PR3MS100ModeStatusTest
[INFO] Running jmri.jmrix.loconet.locostats.LocoStatsFuncTest
[INFO] Tests run: 1, Failures: 0, Errors: 0, Skipped: 0, Time elapsed: 0 s - in jmri.jmrix.loconet.locostats.LocoStatsFuncTest
[INFO] Running jmri.jmrix.loconet.locostats.LocoBufferIIStatusTest
[INFO] Tests run: 1, Failures: 0, Errors: 0, Skipped: 0, Time elapsed: 0 s - in jmri.jmrix.loconet.locostats.LocoBufferIIStatusTest
[INFO] Running jmri.jmrix.loconet.locostats.PR2StatusTest
[INFO] Tests run: 1, Failures: 0, Errors: 0, Skipped: 0, Time elapsed: 0 s - in jmri.jmrix.loconet.locostats.PR2StatusTest
[INFO] Running jmri.jmrix.loconet.bdl16.BundleTest
[INFO] Tests run: 6, Failures: 0, Errors: 0, Skipped: 0, Time elapsed: 0.007 s - in jmri.jmrix.loconet.bdl16.BundleTest
[INFO] Running jmri.jmrix.loconet.bdl16.BDL16PanelTest
[INFO] Tests run: 4, Failures: 0, Errors: 0, Skipped: 0, Time elapsed: 0.042 s - in jmri.jmrix.loconet.bdl16.BDL16PanelTest
[INFO] Running jmri.jmrix.loconet.LocoNetExceptionTest
[INFO] Tests run: 1, Failures: 0, Errors: 0, Skipped: 0, Time elapsed: 0 s - in jmri.jmrix.loconet.LocoNetExceptionTest
[INFO] Running jmri.jmrix.loconet.Ib2ThrottleTest
[INFO] Tests run: 151, Failures: 0, Errors: 0, Skipped: 0, Time elapsed: 0.29 s - in jmri.jmrix.loconet.Ib2ThrottleTest
[INFO] Running jmri.jmrix.loconet.locomon.BundleTest
[INFO] Tests run: 6, Failures: 0, Errors: 0, Skipped: 0, Time elapsed: 0.026 s - in jmri.jmrix.loconet.locomon.BundleTest
[INFO] Running jmri.jmrix.loconet.locomon.LocoMonPaneTest
[INFO] Tests run: 17, Failures: 0, Errors: 0, Skipped: 0, Time elapsed: 4.952 s - in jmri.jmrix.loconet.locomon.LocoMonPaneTest
[INFO] Running jmri.jmrix.loconet.locomon.LlnmonTest
[INFO] Tests run: 39, Failures: 0, Errors: 0, Skipped: 0, Time elapsed: 0.171 s - in jmri.jmrix.loconet.locomon.LlnmonTest
[INFO] Running jmri.jmrix.loconet.Ib1ThrottleTest
[INFO] Tests run: 151, Failures: 0, Errors: 0, Skipped: 0, Time elapsed: 0.273 s - in jmri.jmrix.loconet.Ib1ThrottleTest
[INFO] Running jmri.jmrix.loconet.BundleTest
[INFO] Tests run: 6, Failures: 0, Errors: 0, Skipped: 0, Time elapsed: 0 s - in jmri.jmrix.loconet.BundleTest
[INFO] Running jmri.jmrix.loconet.locobuffer.ConnectionConfigTest
[WARNING] Tests run: 8, Failures: 0, Errors: 0, Skipped: 5, Time elapsed: 0.034 s - in jmri.jmrix.loconet.locobuffer.ConnectionConfigTest
[INFO] Running jmri.jmrix.loconet.locobuffer.configurexml.ConnectionConfigXmlTest
[INFO] Tests run: 4, Failures: 0, Errors: 0, Skipped: 0, Time elapsed: 0.042 s - in jmri.jmrix.loconet.locobuffer.configurexml.ConnectionConfigXmlTest
[INFO] Running jmri.jmrix.loconet.locobuffer.BundleTest
[INFO] Tests run: 6, Failures: 0, Errors: 0, Skipped: 0, Time elapsed: 0 s - in jmri.jmrix.loconet.locobuffer.BundleTest
[INFO] Running jmri.jmrix.loconet.locobuffer.LocoBufferAdapterTest
[INFO] Tests run: 1, Failures: 0, Errors: 0, Skipped: 0, Time elapsed: 0 s - in jmri.jmrix.loconet.locobuffer.LocoBufferAdapterTest
[INFO] Running jmri.jmrix.loconet.Ib1ThrottleManagerTest
[WARNING] Tests run: 16, Failures: 0, Errors: 0, Skipped: 1, Time elapsed: 0.026 s - in jmri.jmrix.loconet.Ib1ThrottleManagerTest
[INFO] Running jmri.jmrix.loconet.SE8cSignalHeadTest
[INFO] Tests run: 2, Failures: 0, Errors: 0, Skipped: 0, Time elapsed: 2.26 s - in jmri.jmrix.loconet.SE8cSignalHeadTest
[INFO] Running jmri.jmrix.loconet.LnReporterTest
[INFO] Tests run: 23, Failures: 0, Errors: 0, Skipped: 0, Time elapsed: 0.096 s - in jmri.jmrix.loconet.LnReporterTest
[INFO] Running jmri.jmrix.loconet.LocoNetSystemConnectionMemoTest
[INFO] Tests run: 10, Failures: 0, Errors: 0, Skipped: 0, Time elapsed: 0.033 s - in jmri.jmrix.loconet.LocoNetSystemConnectionMemoTest
[INFO] Running jmri.jmrix.loconet.LocoNetMessageTest
[INFO] Tests run: 24, Failures: 0, Errors: 0, Skipped: 0, Time elapsed: 0.091 s - in jmri.jmrix.loconet.LocoNetMessageTest
[INFO] Running jmri.jmrix.loconet.LnDeferProgrammerTest
[INFO] Tests run: 11, Failures: 0, Errors: 0, Skipped: 0, Time elapsed: 0.059 s - in jmri.jmrix.loconet.LnDeferProgrammerTest
[INFO] Running jmri.jmrix.loconet.Pr2ThrottleTest
[INFO] Tests run: 151, Failures: 0, Errors: 0, Skipped: 0, Time elapsed: 0.313 s - in jmri.jmrix.loconet.Pr2ThrottleTest
[INFO] Running jmri.jmrix.loconet.locormi.ConnectionConfigTest
[WARNING] Tests run: 8, Failures: 0, Errors: 0, Skipped: 5, Time elapsed: 0.024 s - in jmri.jmrix.loconet.locormi.ConnectionConfigTest
[INFO] Running jmri.jmrix.loconet.locormi.configurexml.ConnectionConfigXmlTest
[WARNING] Tests run: 4, Failures: 0, Errors: 0, Skipped: 2, Time elapsed: 0.01 s - in jmri.jmrix.loconet.locormi.configurexml.ConnectionConfigXmlTest
[INFO] Running jmri.jmrix.loconet.locormi.LnMessageServerActionTest
[INFO] Tests run: 1, Failures: 0, Errors: 0, Skipped: 0, Time elapsed: 0 s - in jmri.jmrix.loconet.locormi.LnMessageServerActionTest
[INFO] Running jmri.jmrix.loconet.locormi.LnMessageClientActionTest
[INFO] Tests run: 1, Failures: 0, Errors: 0, Skipped: 0, Time elapsed: 0 s - in jmri.jmrix.loconet.locormi.LnMessageClientActionTest
[INFO] Running jmri.jmrix.loconet.locormi.BundleTest
[INFO] Tests run: 6, Failures: 0, Errors: 0, Skipped: 0, Time elapsed: 0 s - in jmri.jmrix.loconet.locormi.BundleTest
[INFO] Running jmri.jmrix.loconet.locormi.LnMessageClientPollThreadTest
[INFO] Tests run: 1, Failures: 0, Errors: 0, Skipped: 0, Time elapsed: 0.006 s - in jmri.jmrix.loconet.locormi.LnMessageClientPollThreadTest
[INFO] Running jmri.jmrix.loconet.locormi.LnMessageClientTest
[INFO] Tests run: 1, Failures: 0, Errors: 0, Skipped: 0, Time elapsed: 0.001 s - in jmri.jmrix.loconet.locormi.LnMessageClientTest
[INFO] Running jmri.jmrix.loconet.locormi.LnMessageBufferTest
[INFO] Tests run: 1, Failures: 0, Errors: 0, Skipped: 0, Time elapsed: 0.066 s - in jmri.jmrix.loconet.locormi.LnMessageBufferTest
[INFO] Running jmri.jmrix.loconet.locormi.LnMessageServerTest
[INFO] Tests run: 1, Failures: 0, Errors: 0, Skipped: 0, Time elapsed: 0.004 s - in jmri.jmrix.loconet.locormi.LnMessageServerTest
[INFO] Running jmri.jmrix.loconet.pr2.PR2SystemConnectionMemoTest
[INFO] Tests run: 10, Failures: 0, Errors: 0, Skipped: 0, Time elapsed: 0.025 s - in jmri.jmrix.loconet.pr2.PR2SystemConnectionMemoTest
[INFO] Running jmri.jmrix.loconet.pr2.ConnectionConfigTest
[WARNING] Tests run: 8, Failures: 0, Errors: 0, Skipped: 5, Time elapsed: 0.042 s - in jmri.jmrix.loconet.pr2.ConnectionConfigTest
[INFO] Running jmri.jmrix.loconet.pr2.configurexml.ConnectionConfigXmlTest
[INFO] Tests run: 4, Failures: 0, Errors: 0, Skipped: 0, Time elapsed: 0.04 s - in jmri.jmrix.loconet.pr2.configurexml.ConnectionConfigXmlTest
[INFO] Running jmri.jmrix.loconet.pr2.PR2AdapterTest
[INFO] Tests run: 1, Failures: 0, Errors: 0, Skipped: 0, Time elapsed: 0 s - in jmri.jmrix.loconet.pr2.PR2AdapterTest
[INFO] Running jmri.jmrix.loconet.pr2.BundleTest
[INFO] Tests run: 6, Failures: 0, Errors: 0, Skipped: 0, Time elapsed: 0 s - in jmri.jmrix.loconet.pr2.BundleTest
[INFO] Running jmri.jmrix.loconet.pr2.LnPr2PowerManagerTest
[WARNING] Tests run: 12, Failures: 0, Errors: 0, Skipped: 2, Time elapsed: 0.019 s - in jmri.jmrix.loconet.pr2.LnPr2PowerManagerTest
[INFO] Running jmri.jmrix.loconet.pr2.LnPr2PacketizerTest
[INFO] Tests run: 1, Failures: 0, Errors: 0, Skipped: 0, Time elapsed: 0.001 s - in jmri.jmrix.loconet.pr2.LnPr2PacketizerTest
[INFO] Running jmri.jmrix.loconet.LnClockControlTest
[INFO] Tests run: 4, Failures: 0, Errors: 0, Skipped: 0, Time elapsed: 0.02 s - in jmri.jmrix.loconet.LnClockControlTest
[INFO] Running jmri.jmrix.loconet.lnsvf2.LnSv2MessageContentsTest
[INFO] Tests run: 1, Failures: 0, Errors: 0, Skipped: 0, Time elapsed: 0 s - in jmri.jmrix.loconet.lnsvf2.LnSv2MessageContentsTest
[INFO] Running jmri.jmrix.loconet.lnsvf2.BundleTest
[INFO] Tests run: 6, Failures: 0, Errors: 0, Skipped: 0, Time elapsed: 0.003 s - in jmri.jmrix.loconet.lnsvf2.BundleTest
[INFO] Running jmri.jmrix.loconet.LnProgrammerManagerTest
[INFO] Tests run: 1, Failures: 0, Errors: 0, Skipped: 0, Time elapsed: 0.001 s - in jmri.jmrix.loconet.LnProgrammerManagerTest
[INFO] Running jmri.jmrix.loconet.ds64.Ds64TabbedPanelTest
[INFO] Tests run: 4, Failures: 0, Errors: 0, Skipped: 0, Time elapsed: 0.113 s - in jmri.jmrix.loconet.ds64.Ds64TabbedPanelTest
[INFO] Running jmri.jmrix.loconet.ds64.DS64BundleTest
[INFO] Tests run: 6, Failures: 0, Errors: 0, Skipped: 0, Time elapsed: 0.003 s - in jmri.jmrix.loconet.ds64.DS64BundleTest
[INFO] Running jmri.jmrix.loconet.ds64.SimpleTurnoutStateEntryTest
[INFO] Tests run: 1, Failures: 0, Errors: 0, Skipped: 0, Time elapsed: 0.003 s - in jmri.jmrix.loconet.ds64.SimpleTurnoutStateEntryTest
[INFO] Running jmri.jmrix.loconet.ds64.BundleTest
[INFO] Tests run: 6, Failures: 0, Errors: 0, Skipped: 0, Time elapsed: 0 s - in jmri.jmrix.loconet.ds64.BundleTest
[INFO] Running jmri.jmrix.loconet.ds64.SimpleTurnoutTest
[INFO] Tests run: 1, Failures: 0, Errors: 0, Skipped: 0, Time elapsed: 0 s - in jmri.jmrix.loconet.ds64.SimpleTurnoutTest
[INFO] Running jmri.jmrix.loconet.streamport.configurexml.LnStreamConnectionConfigXmlTest
[INFO] Tests run: 4, Failures: 0, Errors: 0, Skipped: 0, Time elapsed: 0.007 s - in jmri.jmrix.loconet.streamport.configurexml.LnStreamConnectionConfigXmlTest
[INFO] Running jmri.jmrix.loconet.streamport.BundleTest
[INFO] Tests run: 6, Failures: 0, Errors: 0, Skipped: 0, Time elapsed: 0.002 s - in jmri.jmrix.loconet.streamport.BundleTest
[INFO] Running jmri.jmrix.loconet.streamport.LnStreamPortPacketizerTest
[WARNING] Tests run: 3, Failures: 0, Errors: 0, Skipped: 1, Time elapsed: 0.003 s - in jmri.jmrix.loconet.streamport.LnStreamPortPacketizerTest
[INFO] Running jmri.jmrix.loconet.streamport.LnStreamConnectionConfigTest
[WARNING] Tests run: 8, Failures: 0, Errors: 0, Skipped: 5, Time elapsed: 0.006 s - in jmri.jmrix.loconet.streamport.LnStreamConnectionConfigTest
[INFO] Running jmri.jmrix.loconet.streamport.LnStreamPortControllerTest
[INFO] Tests run: 1, Failures: 0, Errors: 0, Skipped: 0, Time elapsed: 0 s - in jmri.jmrix.loconet.streamport.LnStreamPortControllerTest
[INFO] Running jmri.jmrix.loconet.LocoNetThrottledTransmitterTest
[INFO] Tests run: 7, Failures: 0, Errors: 0, Skipped: 0, Time elapsed: 0.222 s - in jmri.jmrix.loconet.LocoNetThrottledTransmitterTest
[INFO] Running jmri.jmrix.loconet.pr3.ConnectionConfigTest
[WARNING] Tests run: 8, Failures: 0, Errors: 0, Skipped: 5, Time elapsed: 0.031 s - in jmri.jmrix.loconet.pr3.ConnectionConfigTest
[INFO] Running jmri.jmrix.loconet.pr3.configurexml.ConnectionConfigXmlTest
[INFO] Tests run: 4, Failures: 0, Errors: 0, Skipped: 0, Time elapsed: 0.038 s - in jmri.jmrix.loconet.pr3.configurexml.ConnectionConfigXmlTest
[INFO] Running jmri.jmrix.loconet.pr3.swing.BundleTest
[INFO] Tests run: 6, Failures: 0, Errors: 0, Skipped: 0, Time elapsed: 0.003 s - in jmri.jmrix.loconet.pr3.swing.BundleTest
[INFO] Running jmri.jmrix.loconet.pr3.swing.Pr3SelectPaneTest
[INFO] Tests run: 4, Failures: 0, Errors: 0, Skipped: 0, Time elapsed: 0.001 s - in jmri.jmrix.loconet.pr3.swing.Pr3SelectPaneTest
[INFO] Running jmri.jmrix.loconet.pr3.BundleTest
[INFO] Tests run: 6, Failures: 0, Errors: 0, Skipped: 0, Time elapsed: 0 s - in jmri.jmrix.loconet.pr3.BundleTest
[INFO] Running jmri.jmrix.loconet.pr3.PR3SystemConnectionMemoTest
[INFO] Tests run: 10, Failures: 0, Errors: 0, Skipped: 0, Time elapsed: 0.026 s - in jmri.jmrix.loconet.pr3.PR3SystemConnectionMemoTest
[INFO] Running jmri.jmrix.loconet.pr3.PR3AdapterTest
[INFO] Tests run: 1, Failures: 0, Errors: 0, Skipped: 0, Time elapsed: 0 s - in jmri.jmrix.loconet.pr3.PR3AdapterTest
[INFO] Running jmri.jmrix.loconet.cmdstnconfig.CmdStnConfigPaneTest
[INFO] Tests run: 4, Failures: 0, Errors: 0, Skipped: 0, Time elapsed: 0.003 s - in jmri.jmrix.loconet.cmdstnconfig.CmdStnConfigPaneTest
[INFO] Running jmri.jmrix.loconet.cmdstnconfig.BundleTest
[INFO] Tests run: 6, Failures: 0, Errors: 0, Skipped: 0, Time elapsed: 0 s - in jmri.jmrix.loconet.cmdstnconfig.BundleTest
[INFO] Running jmri.jmrix.loconet.SlotManagerTest
[INFO] Tests run: 30, Failures: 0, Errors: 0, Skipped: 0, Time elapsed: 26.955 s - in jmri.jmrix.loconet.SlotManagerTest
[INFO] Running jmri.jmrix.loconet.usb_dcs240.ConnectionConfigTest
[WARNING] Tests run: 8, Failures: 0, Errors: 0, Skipped: 5, Time elapsed: 0.039 s - in jmri.jmrix.loconet.usb_dcs240.ConnectionConfigTest
[INFO] Running jmri.jmrix.loconet.usb_dcs240.configurexml.ConnectionConfigXmlTest
[INFO] Tests run: 4, Failures: 0, Errors: 0, Skipped: 0, Time elapsed: 0.042 s - in jmri.jmrix.loconet.usb_dcs240.configurexml.ConnectionConfigXmlTest
[INFO] Running jmri.jmrix.loconet.usb_dcs240.swing.Dcs240UsbModeSelectPaneTest
[INFO] Tests run: 4, Failures: 0, Errors: 0, Skipped: 0, Time elapsed: 0.003 s - in jmri.jmrix.loconet.usb_dcs240.swing.Dcs240UsbModeSelectPaneTest
[INFO] Running jmri.jmrix.loconet.usb_dcs240.swing.BundleTest
[INFO] Tests run: 6, Failures: 0, Errors: 0, Skipped: 0, Time elapsed: 0.002 s - in jmri.jmrix.loconet.usb_dcs240.swing.BundleTest
[INFO] Running jmri.jmrix.loconet.usb_dcs240.UsbDcs240AdapterTest
[INFO] Tests run: 1, Failures: 0, Errors: 0, Skipped: 0, Time elapsed: 0.002 s - in jmri.jmrix.loconet.usb_dcs240.UsbDcs240AdapterTest
[INFO] Running jmri.jmrix.loconet.usb_dcs240.BundleTest
[INFO] Tests run: 6, Failures: 0, Errors: 0, Skipped: 0, Time elapsed: 0 s - in jmri.jmrix.loconet.usb_dcs240.BundleTest
[INFO] Running jmri.jmrix.loconet.usb_dcs240.UsbDcs240SystemConnectionMemoTest
[INFO] Tests run: 10, Failures: 0, Errors: 0, Skipped: 0, Time elapsed: 0.027 s - in jmri.jmrix.loconet.usb_dcs240.UsbDcs240SystemConnectionMemoTest
[INFO] Running jmri.jmrix.loconet.LnLightManagerTest
[INFO] Tests run: 1, Failures: 0, Errors: 0, Skipped: 0, Time elapsed: 0 s - in jmri.jmrix.loconet.LnLightManagerTest
[INFO] Running jmri.jmrix.loconet.locogen.BundleTest
[INFO] Tests run: 6, Failures: 0, Errors: 0, Skipped: 0, Time elapsed: 0 s - in jmri.jmrix.loconet.locogen.BundleTest
[INFO] Running jmri.jmrix.loconet.locogen.LocoGenPanelTest
[INFO] Tests run: 4, Failures: 0, Errors: 0, Skipped: 0, Time elapsed: 0.008 s - in jmri.jmrix.loconet.locogen.LocoGenPanelTest
[INFO] Running jmri.jmrix.loconet.locogen.LocoGenTest
[INFO] Tests run: 2, Failures: 0, Errors: 0, Skipped: 0, Time elapsed: 0 s - in jmri.jmrix.loconet.locogen.LocoGenTest
[INFO] Running jmri.jmrix.loconet.LnPortControllerTest
[INFO] Tests run: 1, Failures: 0, Errors: 0, Skipped: 0, Time elapsed: 0 s - in jmri.jmrix.loconet.LnPortControllerTest
[INFO] Running jmri.jmrix.loconet.LocoNetConsistTest
[INFO] Tests run: 18, Failures: 0, Errors: 0, Skipped: 0, Time elapsed: 13.237 s - in jmri.jmrix.loconet.LocoNetConsistTest
[INFO] Running jmri.jmrix.loconet.LnNetworkPortControllerTest
[INFO] Tests run: 1, Failures: 0, Errors: 0, Skipped: 0, Time elapsed: 0.001 s - in jmri.jmrix.loconet.LnNetworkPortControllerTest
[INFO] Running jmri.jmrix.loconet.LnMessageManagerTest
[INFO] Tests run: 1, Failures: 0, Errors: 0, Skipped: 0, Time elapsed: 0 s - in jmri.jmrix.loconet.LnMessageManagerTest
[INFO] Running jmri.jmrix.loconet.LnSensorAddressTest
[INFO] Tests run: 6, Failures: 0, Errors: 0, Skipped: 0, Time elapsed: 0.003 s - in jmri.jmrix.loconet.LnSensorAddressTest
[INFO] Running jmri.jmrix.loconet.downloader.BundleTest
[INFO] Tests run: 6, Failures: 0, Errors: 0, Skipped: 0, Time elapsed: 0.007 s - in jmri.jmrix.loconet.downloader.BundleTest
[INFO] Running jmri.jmrix.loconet.downloader.LoaderPaneTest
[INFO] Tests run: 5, Failures: 0, Errors: 0, Skipped: 0, Time elapsed: 0.036 s - in jmri.jmrix.loconet.downloader.LoaderPaneTest
[INFO] Running jmri.jmrix.loconet.LnLightTest
[INFO] Tests run: 1, Failures: 0, Errors: 0, Skipped: 0, Time elapsed: 0.001 s - in jmri.jmrix.loconet.LnLightTest
[INFO] Running jmri.jmrix.loconet.LnCabSignalTest
[INFO] Tests run: 2, Failures: 0, Errors: 0, Skipped: 0, Time elapsed: 0.006 s - in jmri.jmrix.loconet.LnCabSignalTest
[INFO] Running jmri.jmrix.loconet.LnConstantsTest
[INFO] Tests run: 6, Failures: 0, Errors: 0, Skipped: 0, Time elapsed: 0.003 s - in jmri.jmrix.loconet.LnConstantsTest
[INFO] Running jmri.jmrix.loconet.messageinterp.LocoNetMessageInterpretTest
[INFO] Tests run: 43, Failures: 0, Errors: 0, Skipped: 0, Time elapsed: 0.091 s - in jmri.jmrix.loconet.messageinterp.LocoNetMessageInterpretTest
[INFO] Running jmri.jmrix.loconet.messageinterp.BundleTest
[INFO] Tests run: 6, Failures: 0, Errors: 0, Skipped: 0, Time elapsed: 0.098 s - in jmri.jmrix.loconet.messageinterp.BundleTest
[INFO] Running jmri.jmrix.loconet.uhlenbrock.ConnectionConfigTest
[WARNING] Tests run: 8, Failures: 0, Errors: 0, Skipped: 5, Time elapsed: 0.04 s - in jmri.jmrix.loconet.uhlenbrock.ConnectionConfigTest
[INFO] Running jmri.jmrix.loconet.uhlenbrock.configurexml.ConnectionConfigXmlTest
[INFO] Tests run: 4, Failures: 0, Errors: 0, Skipped: 0, Time elapsed: 0.042 s - in jmri.jmrix.loconet.uhlenbrock.configurexml.ConnectionConfigXmlTest
[INFO] Running jmri.jmrix.loconet.uhlenbrock.UhlenbrockConnectionTypeListTest
[INFO] Tests run: 1, Failures: 0, Errors: 0, Skipped: 0, Time elapsed: 0 s - in jmri.jmrix.loconet.uhlenbrock.UhlenbrockConnectionTypeListTest
[INFO] Running jmri.jmrix.loconet.uhlenbrock.UhlenbrockProgrammerManagerTest
[INFO] Tests run: 1, Failures: 0, Errors: 0, Skipped: 0, Time elapsed: 0.001 s - in jmri.jmrix.loconet.uhlenbrock.UhlenbrockProgrammerManagerTest
[INFO] Running jmri.jmrix.loconet.uhlenbrock.BundleTest
[INFO] Tests run: 6, Failures: 0, Errors: 0, Skipped: 0, Time elapsed: 0 s - in jmri.jmrix.loconet.uhlenbrock.BundleTest
[INFO] Running jmri.jmrix.loconet.uhlenbrock.UhlenbrockPacketizerTest
[INFO] Tests run: 1, Failures: 0, Errors: 0, Skipped: 0, Time elapsed: 0 s - in jmri.jmrix.loconet.uhlenbrock.UhlenbrockPacketizerTest
[INFO] Running jmri.jmrix.loconet.uhlenbrock.UhlenbrockAdapterTest
[INFO] Tests run: 1, Failures: 0, Errors: 0, Skipped: 0, Time elapsed: 0 s - in jmri.jmrix.loconet.uhlenbrock.UhlenbrockAdapterTest
[INFO] Running jmri.jmrix.loconet.uhlenbrock.UhlenbrockSystemConnectionMemoTest
[INFO] Tests run: 10, Failures: 0, Errors: 0, Skipped: 0, Time elapsed: 0.029 s - in jmri.jmrix.loconet.uhlenbrock.UhlenbrockSystemConnectionMemoTest
[INFO] Running jmri.jmrix.loconet.uhlenbrock.UhlenbrockLnThrottleManagerTest
[WARNING] Tests run: 16, Failures: 0, Errors: 0, Skipped: 1, Time elapsed: 0.025 s - in jmri.jmrix.loconet.uhlenbrock.UhlenbrockLnThrottleManagerTest
[INFO] Running jmri.jmrix.loconet.LnPacketizerTest
[WARNING] Tests run: 3, Failures: 0, Errors: 0, Skipped: 1, Time elapsed: 0.001 s - in jmri.jmrix.loconet.LnPacketizerTest
[INFO] Running jmri.jmrix.loconet.pm4.BundleTest
[INFO] Tests run: 6, Failures: 0, Errors: 0, Skipped: 0, Time elapsed: 0.007 s - in jmri.jmrix.loconet.pm4.BundleTest
[INFO] Running jmri.jmrix.loconet.pm4.PM4PanelTest
[INFO] Tests run: 4, Failures: 0, Errors: 0, Skipped: 0, Time elapsed: 0.033 s - in jmri.jmrix.loconet.pm4.PM4PanelTest
[INFO] Running jmri.jmrix.loconet.TranspondingTagTest
[INFO] Tests run: 7, Failures: 0, Errors: 0, Skipped: 0, Time elapsed: 0.03 s - in jmri.jmrix.loconet.TranspondingTagTest
[INFO] Running jmri.jmrix.loconet.spjfile.SpjFileTest
[INFO] Tests run: 3, Failures: 0, Errors: 0, Skipped: 0, Time elapsed: 0.026 s - in jmri.jmrix.loconet.spjfile.SpjFileTest
[INFO] Running jmri.jmrix.loconet.LnTurnoutTest
[INFO] Tests run: 40, Failures: 0, Errors: 0, Skipped: 0, Time elapsed: 13.225 s - in jmri.jmrix.loconet.LnTurnoutTest
[INFO] Running jmri.jmrix.loconet.UhlenbrockSlotManagerTest
[INFO] Tests run: 1, Failures: 0, Errors: 0, Skipped: 0, Time elapsed: 0 s - in jmri.jmrix.loconet.UhlenbrockSlotManagerTest
[INFO] Running jmri.jmrix.loconet.locobufferusb.ConnectionConfigTest
[WARNING] Tests run: 8, Failures: 0, Errors: 0, Skipped: 5, Time elapsed: 0.034 s - in jmri.jmrix.loconet.locobufferusb.ConnectionConfigTest
[INFO] Running jmri.jmrix.loconet.locobufferusb.configurexml.ConnectionConfigXmlTest
[INFO] Tests run: 4, Failures: 0, Errors: 0, Skipped: 0, Time elapsed: 0.04 s - in jmri.jmrix.loconet.locobufferusb.configurexml.ConnectionConfigXmlTest
[INFO] Running jmri.jmrix.loconet.locobufferusb.BundleTest
[INFO] Tests run: 6, Failures: 0, Errors: 0, Skipped: 0, Time elapsed: 0 s - in jmri.jmrix.loconet.locobufferusb.BundleTest
[INFO] Running jmri.jmrix.loconet.locobufferusb.LocoBufferUsbAdapterTest
[INFO] Tests run: 1, Failures: 0, Errors: 0, Skipped: 0, Time elapsed: 0 s - in jmri.jmrix.loconet.locobufferusb.LocoBufferUsbAdapterTest
[INFO] Running jmri.jmrix.loconet.LnTrafficRouterTest
[INFO] Tests run: 3, Failures: 0, Errors: 0, Skipped: 0, Time elapsed: 0.002 s - in jmri.jmrix.loconet.LnTrafficRouterTest
[INFO] Running jmri.jmrix.loconet.sdf.CommentMacroTest
[INFO] Tests run: 1, Failures: 0, Errors: 0, Skipped: 0, Time elapsed: 0 s - in jmri.jmrix.loconet.sdf.CommentMacroTest
[INFO] Running jmri.jmrix.loconet.sdf.LoadModifierTest
[INFO] Tests run: 1, Failures: 0, Errors: 0, Skipped: 0, Time elapsed: 0 s - in jmri.jmrix.loconet.sdf.LoadModifierTest
[INFO] Running jmri.jmrix.loconet.sdf.SdlVersionTest
[INFO] Tests run: 1, Failures: 0, Errors: 0, Skipped: 0, Time elapsed: 0 s - in jmri.jmrix.loconet.sdf.SdlVersionTest
[INFO] Running jmri.jmrix.loconet.sdf.TwoByteMacroTest
[INFO] Tests run: 1, Failures: 0, Errors: 0, Skipped: 0, Time elapsed: 0 s - in jmri.jmrix.loconet.sdf.TwoByteMacroTest
[INFO] Running jmri.jmrix.loconet.sdf.PlayTest
[INFO] Tests run: 4, Failures: 0, Errors: 0, Skipped: 0, Time elapsed: 0 s - in jmri.jmrix.loconet.sdf.PlayTest
[INFO] Running jmri.jmrix.loconet.sdf.LabelMacroTest
[INFO] Tests run: 1, Failures: 0, Errors: 0, Skipped: 0, Time elapsed: 0 s - in jmri.jmrix.loconet.sdf.LabelMacroTest
[INFO] Running jmri.jmrix.loconet.sdf.GenerateTriggerTest
[INFO] Tests run: 1, Failures: 0, Errors: 0, Skipped: 0, Time elapsed: 0 s - in jmri.jmrix.loconet.sdf.GenerateTriggerTest
[INFO] Running jmri.jmrix.loconet.sdf.SdfBufferTest
[INFO] Tests run: 2, Failures: 0, Errors: 0, Skipped: 0, Time elapsed: 0.006 s - in jmri.jmrix.loconet.sdf.SdfBufferTest
[INFO] Running jmri.jmrix.loconet.sdf.FourByteMacroTest
[INFO] Tests run: 1, Failures: 0, Errors: 0, Skipped: 0, Time elapsed: 0 s - in jmri.jmrix.loconet.sdf.FourByteMacroTest
[INFO] Running jmri.jmrix.loconet.sdf.InitiateSoundTest
[INFO] Tests run: 1, Failures: 0, Errors: 0, Skipped: 0, Time elapsed: 0 s - in jmri.jmrix.loconet.sdf.InitiateSoundTest
[INFO] Running jmri.jmrix.loconet.sdf.SkemeStartTest
[INFO] Tests run: 1, Failures: 0, Errors: 0, Skipped: 0, Time elapsed: 0 s - in jmri.jmrix.loconet.sdf.SkemeStartTest
[INFO] Running jmri.jmrix.loconet.sdf.MaskCompareTest
[INFO] Tests run: 1, Failures: 0, Errors: 0, Skipped: 0, Time elapsed: 0 s - in jmri.jmrix.loconet.sdf.MaskCompareTest
[INFO] Running jmri.jmrix.loconet.sdf.ChannelStartTest
[INFO] Tests run: 1, Failures: 0, Errors: 0, Skipped: 0, Time elapsed: 0 s - in jmri.jmrix.loconet.sdf.ChannelStartTest
[INFO] Running jmri.jmrix.loconet.sdf.BranchToTest
[INFO] Tests run: 1, Failures: 0, Errors: 0, Skipped: 0, Time elapsed: 0 s - in jmri.jmrix.loconet.sdf.BranchToTest
[INFO] Running jmri.jmrix.loconet.sdf.SkipOnTriggerTest
[INFO] Tests run: 1, Failures: 0, Errors: 0, Skipped: 0, Time elapsed: 0 s - in jmri.jmrix.loconet.sdf.SkipOnTriggerTest
[INFO] Running jmri.jmrix.loconet.sdf.DelaySoundTest
[INFO] Tests run: 1, Failures: 0, Errors: 0, Skipped: 0, Time elapsed: 0 s - in jmri.jmrix.loconet.sdf.DelaySoundTest
[INFO] Running jmri.jmrix.loconet.sdf.EndSoundTest
[INFO] Tests run: 1, Failures: 0, Errors: 0, Skipped: 0, Time elapsed: 0 s - in jmri.jmrix.loconet.sdf.EndSoundTest
[INFO] Running jmri.jmrix.loconet.locoio.LocoIOPanelTest
[INFO] Tests run: 7, Failures: 0, Errors: 0, Skipped: 0, Time elapsed: 0.262 s - in jmri.jmrix.loconet.locoio.LocoIOPanelTest
[INFO] Running jmri.jmrix.loconet.locoio.BundleTest
[INFO] Tests run: 6, Failures: 0, Errors: 0, Skipped: 0, Time elapsed: 0 s - in jmri.jmrix.loconet.locoio.BundleTest
[INFO] Running jmri.jmrix.loconet.locoio.LocoIOModeTest
[INFO] Tests run: 1, Failures: 0, Errors: 0, Skipped: 0, Time elapsed: 0 s - in jmri.jmrix.loconet.locoio.LocoIOModeTest
[INFO] Running jmri.jmrix.loconet.locoio.LocoIOModeListTest
[INFO] Tests run: 2, Failures: 0, Errors: 0, Skipped: 0, Time elapsed: 0.012 s - in jmri.jmrix.loconet.locoio.LocoIOModeListTest
[INFO] Running jmri.jmrix.loconet.locoio.LocoIODataTest
[INFO] Tests run: 1, Failures: 0, Errors: 0, Skipped: 0, Time elapsed: 0 s - in jmri.jmrix.loconet.locoio.LocoIODataTest
[INFO] Running jmri.jmrix.loconet.locoio.LocoIOTest
[INFO] Tests run: 1, Failures: 0, Errors: 0, Skipped: 0, Time elapsed: 0 s - in jmri.jmrix.loconet.locoio.LocoIOTest
[INFO] Running jmri.jmrix.loconet.slotmon.SlotMonDataModelTest
[INFO] Tests run: 1, Failures: 0, Errors: 0, Skipped: 0, Time elapsed: 0.004 s - in jmri.jmrix.loconet.slotmon.SlotMonDataModelTest
[INFO] Running jmri.jmrix.loconet.slotmon.BundleTest
[INFO] Tests run: 6, Failures: 0, Errors: 0, Skipped: 0, Time elapsed: 0.001 s - in jmri.jmrix.loconet.slotmon.BundleTest
[INFO] Running jmri.jmrix.loconet.slotmon.SlotMonPaneTest
[INFO] Tests run: 4, Failures: 0, Errors: 0, Skipped: 0, Time elapsed: 0.017 s - in jmri.jmrix.loconet.slotmon.SlotMonPaneTest
[INFO] Running jmri.jmrix.loconet.duplexgroup.swing.LnDplxGrpInfoImplTest
[INFO] Tests run: 27, Failures: 0, Errors: 0, Skipped: 0, Time elapsed: 10.186 s - in jmri.jmrix.loconet.duplexgroup.swing.LnDplxGrpInfoImplTest
[INFO] Running jmri.jmrix.loconet.duplexgroup.swing.DuplexGroupInfoPanelTest
[INFO] Tests run: 4, Failures: 0, Errors: 0, Skipped: 0, Time elapsed: 0.025 s - in jmri.jmrix.loconet.duplexgroup.swing.DuplexGroupInfoPanelTest
[INFO] Running jmri.jmrix.loconet.duplexgroup.swing.BundleTest
[INFO] Tests run: 6, Failures: 0, Errors: 0, Skipped: 0, Time elapsed: 0.004 s - in jmri.jmrix.loconet.duplexgroup.swing.BundleTest
[INFO] Running jmri.jmrix.loconet.duplexgroup.swing.DuplexGroupScanPanelTest
[INFO] Tests run: 4, Failures: 0, Errors: 0, Skipped: 0, Time elapsed: 0.018 s - in jmri.jmrix.loconet.duplexgroup.swing.DuplexGroupScanPanelTest
[INFO] Running jmri.jmrix.loconet.duplexgroup.swing.LnIPLImplementationTest
[WARNING] Tests run: 13, Failures: 0, Errors: 0, Skipped: 2, Time elapsed: 2.179 s - in jmri.jmrix.loconet.duplexgroup.swing.LnIPLImplementationTest
[INFO] Running jmri.jmrix.loconet.duplexgroup.swing.DuplexGroupTabbedPanelTest
[INFO] Tests run: 4, Failures: 0, Errors: 0, Skipped: 0, Time elapsed: 0.009 s - in jmri.jmrix.loconet.duplexgroup.swing.DuplexGroupTabbedPanelTest
[INFO] Running jmri.jmrix.loconet.duplexgroup.LnDplxGrpInfoImplConstantsTest
[INFO] Tests run: 1, Failures: 0, Errors: 0, Skipped: 0, Time elapsed: 0.001 s - in jmri.jmrix.loconet.duplexgroup.LnDplxGrpInfoImplConstantsTest
[INFO] Running jmri.jmrix.loconet.duplexgroup.DuplexGroupMessageTypeTest
[INFO] Tests run: 1, Failures: 0, Errors: 0, Skipped: 0, Time elapsed: 0 s - in jmri.jmrix.loconet.duplexgroup.DuplexGroupMessageTypeTest
[INFO] Running jmri.jmrix.loconet.duplexgroup.BundleTest
[INFO] Tests run: 6, Failures: 0, Errors: 0, Skipped: 0, Time elapsed: 0 s - in jmri.jmrix.loconet.duplexgroup.BundleTest
[INFO] Running jmri.jmrix.loconet.LnTurnoutManagerTest
[WARNING] Tests run: 26, Failures: 0, Errors: 0, Skipped: 1, Time elapsed: 1.131 s - in jmri.jmrix.loconet.LnTurnoutManagerTest
[INFO] Running jmri.jmrix.loconet.LocoNetConsistManagerTest
[INFO] Tests run: 12, Failures: 0, Errors: 0, Skipped: 0, Time elapsed: 0.029 s - in jmri.jmrix.loconet.LocoNetConsistManagerTest
[INFO] Running jmri.jmrix.loconet.LnConnectionTypeListTest
[INFO] Tests run: 1, Failures: 0, Errors: 0, Skipped: 0, Time elapsed: 0 s - in jmri.jmrix.loconet.LnConnectionTypeListTest
[INFO] Running jmri.jmrix.loconet.LnPacketizerStrictTest
[WARNING] Tests run: 3, Failures: 0, Errors: 0, Skipped: 1, Time elapsed: 0.001 s - in jmri.jmrix.loconet.LnPacketizerStrictTest
[INFO] Running jmri.jmrix.loconet.clockmon.BundleTest
[INFO] Tests run: 6, Failures: 0, Errors: 0, Skipped: 0, Time elapsed: 0 s - in jmri.jmrix.loconet.clockmon.BundleTest
[INFO] Running jmri.jmrix.loconet.clockmon.ClockMonPaneTest
[INFO] Tests run: 4, Failures: 0, Errors: 0, Skipped: 0, Time elapsed: 0.001 s - in jmri.jmrix.loconet.clockmon.ClockMonPaneTest
[INFO] Running jmri.jmrix.loconet.LocoNetThrottleTest
[INFO] Tests run: 152, Failures: 0, Errors: 0, Skipped: 0, Time elapsed: 0.274 s - in jmri.jmrix.loconet.LocoNetThrottleTest
[INFO] Running jmri.jmrix.loconet.LnOpsModeProgrammerTest
[INFO] Tests run: 31, Failures: 0, Errors: 0, Skipped: 0, Time elapsed: 2.275 s - in jmri.jmrix.loconet.LnOpsModeProgrammerTest
[INFO] Running jmri.jmrix.loconet.LocoNetMessageExceptionTest
[INFO] Tests run: 2, Failures: 0, Errors: 0, Skipped: 0, Time elapsed: 0 s - in jmri.jmrix.loconet.LocoNetMessageExceptionTest
[INFO] Running jmri.jmrix.loconet.pr4.ConnectionConfigTest
[WARNING] Tests run: 8, Failures: 0, Errors: 0, Skipped: 5, Time elapsed: 0.039 s - in jmri.jmrix.loconet.pr4.ConnectionConfigTest
[INFO] Running jmri.jmrix.loconet.pr4.configurexml.ConnectionConfigXmlTest
[INFO] Tests run: 4, Failures: 0, Errors: 0, Skipped: 0, Time elapsed: 0.044 s - in jmri.jmrix.loconet.pr4.configurexml.ConnectionConfigXmlTest
[INFO] Running jmri.jmrix.loconet.pr4.swing.Pr4SelectPaneTest
[INFO] Tests run: 4, Failures: 0, Errors: 0, Skipped: 0, Time elapsed: 0.004 s - in jmri.jmrix.loconet.pr4.swing.Pr4SelectPaneTest
[INFO] Running jmri.jmrix.loconet.pr4.swing.BundleTest
[INFO] Tests run: 6, Failures: 0, Errors: 0, Skipped: 0, Time elapsed: 0.002 s - in jmri.jmrix.loconet.pr4.swing.BundleTest
[INFO] Running jmri.jmrix.loconet.pr4.BundleTest
[INFO] Tests run: 6, Failures: 0, Errors: 0, Skipped: 0, Time elapsed: 0 s - in jmri.jmrix.loconet.pr4.BundleTest
[INFO] Running jmri.jmrix.loconet.pr4.PR4AdapterTest
[INFO] Tests run: 2, Failures: 0, Errors: 0, Skipped: 0, Time elapsed: 0.001 s - in jmri.jmrix.loconet.pr4.PR4AdapterTest
[INFO] Running jmri.jmrix.loconet.pr4.PR4SystemConnectionMemoTest
[INFO] Tests run: 10, Failures: 0, Errors: 0, Skipped: 0, Time elapsed: 0.028 s - in jmri.jmrix.loconet.pr4.PR4SystemConnectionMemoTest
[INFO] Running jmri.jmrix.loconet.locoid.BundleTest
[INFO] Tests run: 6, Failures: 0, Errors: 0, Skipped: 0, Time elapsed: 0.011 s - in jmri.jmrix.loconet.locoid.BundleTest
[INFO] Running jmri.jmrix.loconet.locoid.LocoIdPanelTest
[INFO] Tests run: 4, Failures: 0, Errors: 0, Skipped: 0, Time elapsed: 0.019 s - in jmri.jmrix.loconet.locoid.LocoIdPanelTest
[INFO] Running jmri.jmrix.loconet.LnPowerManagerTest
[INFO] Tests run: 12, Failures: 0, Errors: 0, Skipped: 0, Time elapsed: 0.029 s - in jmri.jmrix.loconet.LnPowerManagerTest
[INFO] Running jmri.jmrix.loconet.LnReporterManagerTest
[WARNING] Tests run: 21, Failures: 0, Errors: 0, Skipped: 1, Time elapsed: 0.042 s - in jmri.jmrix.loconet.LnReporterManagerTest
[INFO] Running jmri.jmrix.loconet.Intellibox.IntelliboxAdapterTest
[INFO] Tests run: 1, Failures: 0, Errors: 0, Skipped: 0, Time elapsed: 0.004 s - in jmri.jmrix.loconet.Intellibox.IntelliboxAdapterTest
[INFO] Running jmri.jmrix.loconet.Intellibox.ConnectionConfigTest
[WARNING] Tests run: 8, Failures: 0, Errors: 0, Skipped: 5, Time elapsed: 0.044 s - in jmri.jmrix.loconet.Intellibox.ConnectionConfigTest
[INFO] Running jmri.jmrix.loconet.Intellibox.configurexml.ConnectionConfigXmlTest
[INFO] Tests run: 4, Failures: 0, Errors: 0, Skipped: 0, Time elapsed: 0.046 s - in jmri.jmrix.loconet.Intellibox.configurexml.ConnectionConfigXmlTest
[INFO] Running jmri.jmrix.loconet.Intellibox.IbxConnectionTypeListTest
[INFO] Tests run: 1, Failures: 0, Errors: 0, Skipped: 0, Time elapsed: 0 s - in jmri.jmrix.loconet.Intellibox.IbxConnectionTypeListTest
[INFO] Running jmri.jmrix.loconet.Intellibox.BundleTest
[INFO] Tests run: 6, Failures: 0, Errors: 0, Skipped: 0, Time elapsed: 0.001 s - in jmri.jmrix.loconet.Intellibox.BundleTest
[INFO] Running jmri.jmrix.loconet.Intellibox.IBLnPacketizerTest
[INFO] Tests run: 1, Failures: 0, Errors: 0, Skipped: 0, Time elapsed: 0 s - in jmri.jmrix.loconet.Intellibox.IBLnPacketizerTest
[INFO] Running jmri.jmrix.loconet.LnCommandStationTypeTest
[INFO] Tests run: 5, Failures: 0, Errors: 0, Skipped: 0, Time elapsed: 0.002 s - in jmri.jmrix.loconet.LnCommandStationTypeTest
[INFO] Running jmri.jmrix.loconet.loconetovertcp.LnTcpServerFrameTest
[INFO] Tests run: 3, Failures: 0, Errors: 0, Skipped: 0, Time elapsed: 0.111 s - in jmri.jmrix.loconet.loconetovertcp.LnTcpServerFrameTest
[INFO] Running jmri.jmrix.loconet.loconetovertcp.LnTcpPreferencesTest
[INFO] Tests run: 1, Failures: 0, Errors: 0, Skipped: 0, Time elapsed: 0.001 s - in jmri.jmrix.loconet.loconetovertcp.LnTcpPreferencesTest
[INFO] Running jmri.jmrix.loconet.loconetovertcp.ConnectionConfigTest
[WARNING] Tests run: 8, Failures: 0, Errors: 0, Skipped: 5, Time elapsed: 0.019 s - in jmri.jmrix.loconet.loconetovertcp.ConnectionConfigTest
[INFO] Running jmri.jmrix.loconet.loconetovertcp.configurexml.ConnectionConfigXmlTest
[INFO] Tests run: 4, Failures: 0, Errors: 0, Skipped: 0, Time elapsed: 0.024 s - in jmri.jmrix.loconet.loconetovertcp.configurexml.ConnectionConfigXmlTest
[INFO] Running jmri.jmrix.loconet.loconetovertcp.LnOverTcpPacketizerTest
[INFO] Tests run: 1, Failures: 0, Errors: 0, Skipped: 0, Time elapsed: 0.007 s - in jmri.jmrix.loconet.loconetovertcp.LnOverTcpPacketizerTest
[INFO] Running jmri.jmrix.loconet.loconetovertcp.ClientRxHandlerTest
[INFO] Tests run: 1, Failures: 0, Errors: 0, Skipped: 0, Time elapsed: 0.013 s - in jmri.jmrix.loconet.loconetovertcp.ClientRxHandlerTest
[INFO] Running jmri.jmrix.loconet.loconetovertcp.BundleTest
[INFO] Tests run: 6, Failures: 0, Errors: 0, Skipped: 0, Time elapsed: 0.001 s - in jmri.jmrix.loconet.loconetovertcp.BundleTest
[INFO] Running jmri.jmrix.loconet.loconetovertcp.LnTcpServerTest
[INFO] Tests run: 1, Failures: 0, Errors: 0, Skipped: 0, Time elapsed: 0.007 s - in jmri.jmrix.loconet.loconetovertcp.LnTcpServerTest
[INFO] Running jmri.jmrix.loconet.loconetovertcp.LnTcpStartupActionFactoryTest
[INFO] Tests run: 1, Failures: 0, Errors: 0, Skipped: 0, Time elapsed: 0 s - in jmri.jmrix.loconet.loconetovertcp.LnTcpStartupActionFactoryTest
[INFO] Running jmri.jmrix.loconet.loconetovertcp.LnTcpDriverAdapterTest
[INFO] Tests run: 2, Failures: 0, Errors: 0, Skipped: 0, Time elapsed: 0.003 s - in jmri.jmrix.loconet.loconetovertcp.LnTcpDriverAdapterTest
[INFO] Running jmri.jmrix.loconet.loconetovertcp.LnTcpPreferencesPanelTest
[INFO] Tests run: 1, Failures: 0, Errors: 0, Skipped: 0, Time elapsed: 0.224 s - in jmri.jmrix.loconet.loconetovertcp.LnTcpPreferencesPanelTest
[INFO] Running jmri.jmrix.loconet.loconetovertcp.LnTcpServerActionTest
[INFO] Tests run: 2, Failures: 0, Errors: 0, Skipped: 0, Time elapsed: 0.001 s - in jmri.jmrix.loconet.loconetovertcp.LnTcpServerActionTest
[INFO] Running jmri.jmrix.loconet.se8.BundleTest
[INFO] Tests run: 6, Failures: 0, Errors: 0, Skipped: 0, Time elapsed: 0.008 s - in jmri.jmrix.loconet.se8.BundleTest
[INFO] Running jmri.jmrix.loconet.se8.SE8PanelTest
[INFO] Tests run: 4, Failures: 0, Errors: 0, Skipped: 0, Time elapsed: 0.024 s - in jmri.jmrix.loconet.se8.SE8PanelTest
[INFO] Running jmri.jmrix.loconet.LnSensorManagerTest
[WARNING] Tests run: 26, Failures: 0, Errors: 0, Skipped: 1, Time elapsed: 0.052 s - in jmri.jmrix.loconet.LnSensorManagerTest
[INFO] Running jmri.jmrix.loconet.soundloader.LoaderEngineTest
[INFO] Tests run: 7, Failures: 0, Errors: 0, Skipped: 0, Time elapsed: 0.007 s - in jmri.jmrix.loconet.soundloader.LoaderEngineTest
[INFO] Running jmri.jmrix.loconet.soundloader.BundleTest
[INFO] Tests run: 6, Failures: 0, Errors: 0, Skipped: 0, Time elapsed: 0.012 s - in jmri.jmrix.loconet.soundloader.BundleTest
[INFO] Running jmri.jmrix.loconet.soundloader.EditorTableDataModelTest
[INFO] Tests run: 1, Failures: 0, Errors: 0, Skipped: 0, Time elapsed: 0.003 s - in jmri.jmrix.loconet.soundloader.EditorTableDataModelTest
[INFO] Running jmri.jmrix.loconet.soundloader.EditorPaneTest
[INFO] Tests run: 4, Failures: 0, Errors: 0, Skipped: 0, Time elapsed: 0.007 s - in jmri.jmrix.loconet.soundloader.EditorPaneTest
[INFO] Running jmri.jmrix.loconet.soundloader.LoaderPaneTest
[INFO] Tests run: 4, Failures: 0, Errors: 0, Skipped: 0, Time elapsed: 0.014 s - in jmri.jmrix.loconet.soundloader.LoaderPaneTest
[INFO] Running jmri.jmrix.loconet.soundloader.EditorFilePaneTest
[INFO] Tests run: 1, Failures: 0, Errors: 0, Skipped: 0, Time elapsed: 0.007 s - in jmri.jmrix.loconet.soundloader.EditorFilePaneTest
[INFO] Running jmri.jmrix.ConflictingSystemConnectionMemoTest
[INFO] Tests run: 10, Failures: 0, Errors: 0, Skipped: 0, Time elapsed: 0.008 s - in jmri.jmrix.ConflictingSystemConnectionMemoTest
[INFO] Running jmri.jmrix.ConnectionConfigManagerTest
[INFO] Tests run: 11, Failures: 0, Errors: 0, Skipped: 0, Time elapsed: 0.035 s - in jmri.jmrix.ConnectionConfigManagerTest
[INFO] Running jmri.jmris.JmriServerFrameTest
[INFO] Tests run: 2, Failures: 0, Errors: 0, Skipped: 0, Time elapsed: 0.088 s - in jmri.jmris.JmriServerFrameTest
[INFO] Running jmri.jmris.AbstractSignalMastServerTest
[INFO] Tests run: 1, Failures: 0, Errors: 0, Skipped: 0, Time elapsed: 0 s - in jmri.jmris.AbstractSignalMastServerTest
[INFO] Running jmri.jmris.srcp.JmriSRCPPowerServerTest
[INFO] Tests run: 9, Failures: 0, Errors: 0, Skipped: 0, Time elapsed: 0.009 s - in jmri.jmris.srcp.JmriSRCPPowerServerTest
[INFO] Running jmri.jmris.srcp.JmriSRCPTimeServerTest
[INFO] Tests run: 7, Failures: 0, Errors: 0, Skipped: 0, Time elapsed: 0.013 s - in jmri.jmris.srcp.JmriSRCPTimeServerTest
[INFO] Running jmri.jmris.srcp.JmriSRCPServerPreferencesPanelTest
[INFO] Tests run: 1, Failures: 0, Errors: 0, Skipped: 0, Time elapsed: 0.019 s - in jmri.jmris.srcp.JmriSRCPServerPreferencesPanelTest
[INFO] Running jmri.jmris.srcp.JmriSRCPThrottleServerTest
[INFO] Tests run: 6, Failures: 0, Errors: 0, Skipped: 0, Time elapsed: 0.013 s - in jmri.jmris.srcp.JmriSRCPThrottleServerTest
[INFO] Running jmri.jmris.srcp.TimeStampedOutputTest
[INFO] Tests run: 1, Failures: 0, Errors: 0, Skipped: 0, Time elapsed: 0 s - in jmri.jmris.srcp.TimeStampedOutputTest
[INFO] Running jmri.jmris.srcp.BundleTest
[INFO] Tests run: 6, Failures: 0, Errors: 0, Skipped: 0, Time elapsed: 0.005 s - in jmri.jmris.srcp.BundleTest
[INFO] Running jmri.jmris.srcp.JmriSRCPServerTest
[INFO] Tests run: 2, Failures: 0, Errors: 0, Skipped: 0, Time elapsed: 0.002 s - in jmri.jmris.srcp.JmriSRCPServerTest
[INFO] Running jmri.jmris.srcp.JmriSRCPTurnoutServerTest
[WARNING] Tests run: 8, Failures: 0, Errors: 0, Skipped: 2, Time elapsed: 0.602 s - in jmri.jmris.srcp.JmriSRCPTurnoutServerTest
[INFO] Running jmri.jmris.srcp.JmriSRCPServerMenuTest
[INFO] Tests run: 2, Failures: 0, Errors: 0, Skipped: 0, Time elapsed: 0.002 s - in jmri.jmris.srcp.JmriSRCPServerMenuTest
[INFO] Running jmri.jmris.srcp.JmriSRCPSensorServerTest
[INFO] Tests run: 8, Failures: 0, Errors: 0, Skipped: 0, Time elapsed: 0.011 s - in jmri.jmris.srcp.JmriSRCPSensorServerTest
[INFO] Running jmri.jmris.srcp.JmriSRCPProgrammerServerTest
[INFO] Tests run: 1, Failures: 0, Errors: 0, Skipped: 0, Time elapsed: 0 s - in jmri.jmris.srcp.JmriSRCPProgrammerServerTest
[INFO] Running jmri.jmris.srcp.JmriSRCPServerManagerTest
[INFO] Tests run: 1, Failures: 0, Errors: 0, Skipped: 0, Time elapsed: 0 s - in jmri.jmris.srcp.JmriSRCPServerManagerTest
[INFO] Running jmri.jmris.srcp.JmriSRCPServerActionTest
[INFO] Tests run: 2, Failures: 0, Errors: 0, Skipped: 0, Time elapsed: 0 s - in jmri.jmris.srcp.JmriSRCPServerActionTest
[INFO] Running jmri.jmris.srcp.JmriSRCPServerPreferencesTest
[INFO] Tests run: 3, Failures: 0, Errors: 0, Skipped: 0, Time elapsed: 0 s - in jmri.jmris.srcp.JmriSRCPServerPreferencesTest
[INFO] Running jmri.jmris.srcp.JmriSRCPServerFrameTest
[INFO] Tests run: 2, Failures: 0, Errors: 0, Skipped: 0, Time elapsed: 0.044 s - in jmri.jmris.srcp.JmriSRCPServerFrameTest
[INFO] Running jmri.jmris.srcp.parser.SRCPParserTest
[INFO] Tests run: 48, Failures: 0, Errors: 0, Skipped: 0, Time elapsed: 0.135 s - in jmri.jmris.srcp.parser.SRCPParserTest
[INFO] Running jmri.jmris.srcp.parser.SRCPVisitorTest
[INFO] Tests run: 4, Failures: 0, Errors: 0, Skipped: 0, Time elapsed: 0.009 s - in jmri.jmris.srcp.parser.SRCPVisitorTest
[INFO] Running jmri.jmris.srcp.parser.SRCPTokenizerTest
[INFO] Tests run: 26, Failures: 0, Errors: 0, Skipped: 0, Time elapsed: 0.017 s - in jmri.jmris.srcp.parser.SRCPTokenizerTest
[INFO] Running jmri.jmris.srcp.JmriSRCPServiceHandlerTest
[INFO] Tests run: 1, Failures: 0, Errors: 0, Skipped: 0, Time elapsed: 0.001 s - in jmri.jmris.srcp.JmriSRCPServiceHandlerTest
[INFO] Running jmri.jmris.JmriServerTest
[INFO] Tests run: 3, Failures: 0, Errors: 0, Skipped: 0, Time elapsed: 0.001 s - in jmri.jmris.JmriServerTest
[INFO] Running jmri.jmris.BundleTest
[INFO] Tests run: 6, Failures: 0, Errors: 0, Skipped: 0, Time elapsed: 0 s - in jmri.jmris.BundleTest
[INFO] Running jmri.jmris.simpleserver.SimpleReporterServerTest
[INFO] Tests run: 10, Failures: 0, Errors: 0, Skipped: 0, Time elapsed: 0.013 s - in jmri.jmris.simpleserver.SimpleReporterServerTest
[INFO] Running jmri.jmris.simpleserver.SimpleServerFrameTest
[INFO] Tests run: 2, Failures: 0, Errors: 0, Skipped: 0, Time elapsed: 0.062 s - in jmri.jmris.simpleserver.SimpleServerFrameTest
[INFO] Running jmri.jmris.simpleserver.BundleTest
[INFO] Tests run: 6, Failures: 0, Errors: 0, Skipped: 0, Time elapsed: 0.009 s - in jmri.jmris.simpleserver.BundleTest
[INFO] Running jmri.jmris.simpleserver.SimpleServerActionTest
[INFO] Tests run: 2, Failures: 0, Errors: 0, Skipped: 0, Time elapsed: 0.001 s - in jmri.jmris.simpleserver.SimpleServerActionTest
[INFO] Running jmri.jmris.simpleserver.SimpleServerManagerTest
[INFO] Tests run: 1, Failures: 0, Errors: 0, Skipped: 0, Time elapsed: 0.002 s - in jmri.jmris.simpleserver.SimpleServerManagerTest
[INFO] Running jmri.jmris.simpleserver.SimpleOperationsServerTest
[INFO] Tests run: 12, Failures: 0, Errors: 0, Skipped: 0, Time elapsed: 0.757 s - in jmri.jmris.simpleserver.SimpleOperationsServerTest
[INFO] Running jmri.jmris.simpleserver.SimplePowerServerTest
[INFO] Tests run: 14, Failures: 0, Errors: 0, Skipped: 0, Time elapsed: 0.085 s - in jmri.jmris.simpleserver.SimplePowerServerTest
[INFO] Running jmri.jmris.simpleserver.SimpleServerPreferencesPanelTest
[INFO] Tests run: 1, Failures: 0, Errors: 0, Skipped: 0, Time elapsed: 0.006 s - in jmri.jmris.simpleserver.SimpleServerPreferencesPanelTest
[INFO] Running jmri.jmris.simpleserver.SimpleSensorServerTest
[INFO] Tests run: 16, Failures: 0, Errors: 0, Skipped: 0, Time elapsed: 0.012 s - in jmri.jmris.simpleserver.SimpleSensorServerTest
[INFO] Running jmri.jmris.simpleserver.SimpleServerPreferencesTest
[INFO] Tests run: 3, Failures: 0, Errors: 0, Skipped: 0, Time elapsed: 0.001 s - in jmri.jmris.simpleserver.SimpleServerPreferencesTest
[INFO] Running jmri.jmris.simpleserver.SimpleServerMenuTest
[INFO] Tests run: 2, Failures: 0, Errors: 0, Skipped: 0, Time elapsed: 0.003 s - in jmri.jmris.simpleserver.SimpleServerMenuTest
[INFO] Running jmri.jmris.simpleserver.SimpleLightServerTest
[INFO] Tests run: 12, Failures: 0, Errors: 0, Skipped: 0, Time elapsed: 0.01 s - in jmri.jmris.simpleserver.SimpleLightServerTest
[INFO] Running jmri.jmris.simpleserver.SimpleServerTest
[INFO] Tests run: 3, Failures: 0, Errors: 0, Skipped: 0, Time elapsed: 0.049 s - in jmri.jmris.simpleserver.SimpleServerTest
[INFO] Running jmri.jmris.simpleserver.SimpleSignalHeadServerTest
[INFO] Tests run: 13, Failures: 0, Errors: 0, Skipped: 0, Time elapsed: 0.014 s - in jmri.jmris.simpleserver.SimpleSignalHeadServerTest
[INFO] Running jmri.jmris.simpleserver.SimpleTurnoutServerTest
[INFO] Tests run: 11, Failures: 0, Errors: 0, Skipped: 0, Time elapsed: 0.007 s - in jmri.jmris.simpleserver.SimpleTurnoutServerTest
[INFO] Running jmri.jmris.simpleserver.parser.JmriServerParserTest
[INFO] Tests run: 36, Failures: 0, Errors: 0, Skipped: 0, Time elapsed: 0.027 s - in jmri.jmris.simpleserver.parser.JmriServerParserTest
[INFO] Running jmri.jmris.simpleserver.parser.SimpleVisitorTest
[INFO] Tests run: 1, Failures: 0, Errors: 0, Skipped: 0, Time elapsed: 0 s - in jmri.jmris.simpleserver.parser.SimpleVisitorTest
[INFO] Running jmri.jmris.simpleserver.parser.JmriServerTokenizerTest
[INFO] Tests run: 24, Failures: 0, Errors: 0, Skipped: 0, Time elapsed: 0.013 s - in jmri.jmris.simpleserver.parser.JmriServerTokenizerTest
[INFO] Running jmri.jmris.JmriServerActionTest
[INFO] Tests run: 1, Failures: 0, Errors: 0, Skipped: 0, Time elapsed: 0 s - in jmri.jmris.JmriServerActionTest
[INFO] Running jmri.jmris.JmriConnectionTest
[INFO] Tests run: 1, Failures: 0, Errors: 0, Skipped: 0, Time elapsed: 0 s - in jmri.jmris.JmriConnectionTest
[INFO] Running jmri.jmris.ServiceHandlerTest
[INFO] Tests run: 7, Failures: 0, Errors: 0, Skipped: 0, Time elapsed: 0.004 s - in jmri.jmris.ServiceHandlerTest
[INFO] Running jmri.jmris.json.JsonServerPreferencesPanelTest
[INFO] Tests run: 1, Failures: 0, Errors: 0, Skipped: 0, Time elapsed: 0.014 s - in jmri.jmris.json.JsonServerPreferencesPanelTest
[INFO] Running jmri.jmris.json.JsonProgrammerServerTest
[INFO] Tests run: 1, Failures: 0, Errors: 0, Skipped: 0, Time elapsed: 0.002 s - in jmri.jmris.json.JsonProgrammerServerTest
[INFO] Running jmri.jmris.json.BundleTest
[INFO] Tests run: 6, Failures: 0, Errors: 0, Skipped: 0, Time elapsed: 0.003 s - in jmri.jmris.json.BundleTest
[INFO] Running jmri.jmris.json.JsonServerActionTest
[INFO] Tests run: 1, Failures: 0, Errors: 0, Skipped: 0, Time elapsed: 0 s - in jmri.jmris.json.JsonServerActionTest
[INFO] Running jmri.jmris.json.JsonServerTest
[INFO] Tests run: 2, Failures: 0, Errors: 0, Skipped: 0, Time elapsed: 0.001 s - in jmri.jmris.json.JsonServerTest
[INFO] Running jmri.jmris.json.JsonServerPreferencesTest
[INFO] Tests run: 1, Failures: 0, Errors: 0, Skipped: 0, Time elapsed: 0 s - in jmri.jmris.json.JsonServerPreferencesTest
[INFO] Running jmri.jmris.ServerMenuTest
[INFO] Tests run: 1, Failures: 0, Errors: 0, Skipped: 0, Time elapsed: 0.002 s - in jmri.jmris.ServerMenuTest
[INFO] Running jmri.jmris.AbstractRouteServerTest
[INFO] Tests run: 1, Failures: 0, Errors: 0, Skipped: 0, Time elapsed: 0 s - in jmri.jmris.AbstractRouteServerTest
[INFO] Running jmri.NamedBeanPropertyDescriptorTest
[INFO] Tests run: 1, Failures: 0, Errors: 0, Skipped: 0, Time elapsed: 0.005 s - in jmri.NamedBeanPropertyDescriptorTest
[INFO] Running jmri.SignalGroupTest
[INFO] Tests run: 1, Failures: 0, Errors: 0, Skipped: 0, Time elapsed: 0.077 s - in jmri.SignalGroupTest
[INFO] Running jmri.IdTagTest
[INFO] Tests run: 2, Failures: 0, Errors: 0, Skipped: 0, Time elapsed: 0.012 s - in jmri.IdTagTest
[INFO] Running jmri.profile.ProfileListModelTest
[INFO] Tests run: 1, Failures: 0, Errors: 0, Skipped: 0, Time elapsed: 0.001 s - in jmri.profile.ProfileListModelTest
[INFO] Running jmri.profile.SearchPathTableModelTest
[INFO] Tests run: 1, Failures: 0, Errors: 0, Skipped: 0, Time elapsed: 0 s - in jmri.profile.SearchPathTableModelTest
[INFO] Running jmri.profile.ProfileManagerDialogTest
[WARNING] Tests run: 1, Failures: 0, Errors: 0, Skipped: 1, Time elapsed: 0 s - in jmri.profile.ProfileManagerDialogTest
[INFO] Running jmri.profile.ProfileUtilsTest
[INFO] Tests run: 2, Failures: 0, Errors: 0, Skipped: 0, Time elapsed: 0.048 s - in jmri.profile.ProfileUtilsTest
[INFO] Running jmri.profile.ProfileFileViewTest
[INFO] Tests run: 1, Failures: 0, Errors: 0, Skipped: 0, Time elapsed: 0.011 s - in jmri.profile.ProfileFileViewTest
[INFO] Running jmri.profile.ProfileConfigurationTest
[INFO] Tests run: 1, Failures: 0, Errors: 0, Skipped: 0, Time elapsed: 0.017 s - in jmri.profile.ProfileConfigurationTest
[INFO] Running jmri.profile.NullProfileTest
[INFO] Tests run: 1, Failures: 0, Errors: 0, Skipped: 0, Time elapsed: 0.002 s - in jmri.profile.NullProfileTest
[INFO] Running jmri.profile.BundleTest
[INFO] Tests run: 6, Failures: 0, Errors: 0, Skipped: 0, Time elapsed: 0.008 s - in jmri.profile.BundleTest
[INFO] Running jmri.profile.ProfileTest
[INFO] Tests run: 15, Failures: 0, Errors: 0, Skipped: 0, Time elapsed: 0.063 s - in jmri.profile.ProfileTest
[INFO] Running jmri.profile.ProfileListCellRendererTest
[INFO] Tests run: 1, Failures: 0, Errors: 0, Skipped: 0, Time elapsed: 0.004 s - in jmri.profile.ProfileListCellRendererTest
[INFO] Running jmri.profile.ProfilePreferencesPanelTest
[INFO] Tests run: 1, Failures: 0, Errors: 0, Skipped: 0, Time elapsed: 0.062 s - in jmri.profile.ProfilePreferencesPanelTest
[INFO] Running jmri.profile.ProfileFileFilterTest
[INFO] Tests run: 1, Failures: 0, Errors: 0, Skipped: 0, Time elapsed: 0 s - in jmri.profile.ProfileFileFilterTest
[INFO] Running jmri.profile.ProfilePropertiesTest
[INFO] Tests run: 1, Failures: 0, Errors: 0, Skipped: 0, Time elapsed: 0.003 s - in jmri.profile.ProfilePropertiesTest
[INFO] Running jmri.profile.AddProfileDialogTest
[INFO] Tests run: 2, Failures: 0, Errors: 0, Skipped: 0, Time elapsed: 0.037 s - in jmri.profile.AddProfileDialogTest
[INFO] Running jmri.profile.ProfileTableModelTest
[INFO] Tests run: 1, Failures: 0, Errors: 0, Skipped: 0, Time elapsed: 0 s - in jmri.profile.ProfileTableModelTest
[INFO] Running jmri.profile.ProfileManagerTest
[INFO] Tests run: 3, Failures: 0, Errors: 0, Skipped: 0, Time elapsed: 0.025 s - in jmri.profile.ProfileManagerTest
[INFO] Running jmri.SensorTurnoutOperationTest
[INFO] Tests run: 1, Failures: 0, Errors: 0, Skipped: 0, Time elapsed: 0 s - in jmri.SensorTurnoutOperationTest
[INFO] Running jmri.ManagerTest
[INFO] Tests run: 9, Failures: 0, Errors: 0, Skipped: 0, Time elapsed: 0.017 s - in jmri.ManagerTest
[INFO] Running jmri.RawTurnoutOperationTest
[INFO] Tests run: 1, Failures: 0, Errors: 0, Skipped: 0, Time elapsed: 0 s - in jmri.RawTurnoutOperationTest
[INFO] Running jmri.TimebaseRateExceptionTest
[INFO] Tests run: 2, Failures: 0, Errors: 0, Skipped: 0, Time elapsed: 0 s - in jmri.TimebaseRateExceptionTest
[INFO] Running jmri.ScaleManagerTest
[INFO] Tests run: 2, Failures: 0, Errors: 0, Skipped: 0, Time elapsed: 0 s - in jmri.ScaleManagerTest
[INFO] Running jmri.web.servlet.config.ConfigServletTest
[INFO] Tests run: 1, Failures: 0, Errors: 0, Skipped: 0, Time elapsed: 0 s - in jmri.web.servlet.config.ConfigServletTest
[INFO] Running jmri.web.servlet.config.BundleTest
[INFO] Tests run: 6, Failures: 0, Errors: 0, Skipped: 0, Time elapsed: 0.006 s - in jmri.web.servlet.config.BundleTest
[INFO] Running jmri.web.servlet.ServletUtilTest
[INFO] Tests run: 3, Failures: 0, Errors: 0, Skipped: 0, Time elapsed: 0.065 s - in jmri.web.servlet.ServletUtilTest
[INFO] Running jmri.web.servlet.roster.FileMetaTest
[INFO] Tests run: 1, Failures: 0, Errors: 0, Skipped: 0, Time elapsed: 0 s - in jmri.web.servlet.roster.FileMetaTest
[INFO] Running jmri.web.servlet.roster.BundleTest
[INFO] Tests run: 6, Failures: 0, Errors: 0, Skipped: 0, Time elapsed: 0.007 s - in jmri.web.servlet.roster.BundleTest
[INFO] Running jmri.web.servlet.roster.MultipartRequestHandlerTest
[INFO] Tests run: 1, Failures: 0, Errors: 0, Skipped: 0, Time elapsed: 0.001 s - in jmri.web.servlet.roster.MultipartRequestHandlerTest
[INFO] Running jmri.web.servlet.roster.RosterServletTest
[INFO] Tests run: 1, Failures: 0, Errors: 0, Skipped: 0, Time elapsed: 0 s - in jmri.web.servlet.roster.RosterServletTest
[INFO] Running jmri.web.servlet.DenialServletTest
[INFO] Tests run: 3, Failures: 0, Errors: 0, Skipped: 0, Time elapsed: 0.001 s - in jmri.web.servlet.DenialServletTest
[INFO] Running jmri.web.servlet.frameimage.JmriJFrameServletTest
[INFO] Tests run: 3, Failures: 0, Errors: 0, Skipped: 0, Time elapsed: 0.004 s - in jmri.web.servlet.frameimage.JmriJFrameServletTest
[INFO] Running jmri.web.servlet.frameimage.BundleTest
[INFO] Tests run: 6, Failures: 0, Errors: 0, Skipped: 0, Time elapsed: 0.009 s - in jmri.web.servlet.frameimage.BundleTest
[INFO] Running jmri.web.servlet.BundleTest
[INFO] Tests run: 6, Failures: 0, Errors: 0, Skipped: 0, Time elapsed: 0 s - in jmri.web.servlet.BundleTest
[INFO] Running jmri.web.servlet.operations.HtmlConductorTest
[INFO] Tests run: 1, Failures: 0, Errors: 0, Skipped: 0, Time elapsed: 0.068 s - in jmri.web.servlet.operations.HtmlConductorTest
[INFO] Running jmri.web.servlet.operations.OperationsServletTest
[INFO] Tests run: 1, Failures: 0, Errors: 0, Skipped: 0, Time elapsed: 0 s - in jmri.web.servlet.operations.OperationsServletTest
[INFO] Running jmri.web.servlet.operations.BundleTest
[INFO] Tests run: 6, Failures: 0, Errors: 0, Skipped: 0, Time elapsed: 0.001 s - in jmri.web.servlet.operations.BundleTest
[INFO] Running jmri.web.servlet.operations.HtmlTrainCommonTest
[INFO] Tests run: 1, Failures: 0, Errors: 0, Skipped: 0, Time elapsed: 0.053 s - in jmri.web.servlet.operations.HtmlTrainCommonTest
[INFO] Running jmri.web.servlet.operations.HtmlManifestTest
[INFO] Tests run: 1, Failures: 0, Errors: 0, Skipped: 0, Time elapsed: 0.058 s - in jmri.web.servlet.operations.HtmlManifestTest
[INFO] Running jmri.web.servlet.RedirectionServletTest
[INFO] Tests run: 3, Failures: 0, Errors: 0, Skipped: 0, Time elapsed: 0.003 s - in jmri.web.servlet.RedirectionServletTest
[INFO] Running jmri.web.servlet.simple.BundleTest
[INFO] Tests run: 6, Failures: 0, Errors: 0, Skipped: 0, Time elapsed: 0.008 s - in jmri.web.servlet.simple.BundleTest
[INFO] Running jmri.web.servlet.simple.SimpleServletTest
[INFO] Tests run: 1, Failures: 0, Errors: 0, Skipped: 0, Time elapsed: 0 s - in jmri.web.servlet.simple.SimpleServletTest
[INFO] Running jmri.web.servlet.tables.TablesServletTest
[INFO] Tests run: 1, Failures: 0, Errors: 0, Skipped: 0, Time elapsed: 0 s - in jmri.web.servlet.tables.TablesServletTest
[INFO] Running jmri.web.servlet.tables.BundleTest
[INFO] Tests run: 6, Failures: 0, Errors: 0, Skipped: 0, Time elapsed: 0.006 s - in jmri.web.servlet.tables.BundleTest
[INFO] Running jmri.web.servlet.home.HomeServletTest
[INFO] Tests run: 1, Failures: 0, Errors: 0, Skipped: 0, Time elapsed: 0 s - in jmri.web.servlet.home.HomeServletTest
[INFO] Running jmri.web.servlet.home.BundleTest
[INFO] Tests run: 6, Failures: 0, Errors: 0, Skipped: 0, Time elapsed: 0.001 s - in jmri.web.servlet.home.BundleTest
[INFO] Running jmri.web.servlet.panel.AbstractPanelServletTest
[INFO] Tests run: 1, Failures: 0, Errors: 0, Skipped: 0, Time elapsed: 0.009 s - in jmri.web.servlet.panel.AbstractPanelServletTest
[INFO] Running jmri.web.servlet.panel.BundleTest
[INFO] Tests run: 6, Failures: 0, Errors: 0, Skipped: 0, Time elapsed: 0.008 s - in jmri.web.servlet.panel.BundleTest
[INFO] Running jmri.web.servlet.panel.PanelServletTest
[INFO] Tests run: 1, Failures: 0, Errors: 0, Skipped: 0, Time elapsed: 0.001 s - in jmri.web.servlet.panel.PanelServletTest
[INFO] Running jmri.web.servlet.panel.ControlPanelServletTest
[INFO] Tests run: 1, Failures: 0, Errors: 0, Skipped: 0, Time elapsed: 0 s - in jmri.web.servlet.panel.ControlPanelServletTest
[INFO] Running jmri.web.servlet.panel.LayoutPanelServletTest
[INFO] Tests run: 1, Failures: 0, Errors: 0, Skipped: 0, Time elapsed: 0 s - in jmri.web.servlet.panel.LayoutPanelServletTest
[INFO] Running jmri.web.servlet.panel.SwitchboardServletTest
[INFO] Tests run: 1, Failures: 0, Errors: 0, Skipped: 0, Time elapsed: 0 s - in jmri.web.servlet.panel.SwitchboardServletTest
[INFO] Running jmri.web.servlet.directory.DirectoryResourceTest
[INFO] Tests run: 1, Failures: 0, Errors: 0, Skipped: 0, Time elapsed: 0.002 s - in jmri.web.servlet.directory.DirectoryResourceTest
[INFO] Running jmri.web.servlet.directory.BundleTest
[INFO] Tests run: 6, Failures: 0, Errors: 0, Skipped: 0, Time elapsed: 0.009 s - in jmri.web.servlet.directory.BundleTest
[INFO] Running jmri.web.servlet.directory.DirectoryHandlerTest
[INFO] Tests run: 1, Failures: 0, Errors: 0, Skipped: 0, Time elapsed: 0 s - in jmri.web.servlet.directory.DirectoryHandlerTest
[INFO] Running jmri.web.servlet.directory.DirectoryServiceTest
[INFO] Tests run: 1, Failures: 0, Errors: 0, Skipped: 0, Time elapsed: 0 s - in jmri.web.servlet.directory.DirectoryServiceTest
[INFO] Running jmri.web.servlet.about.AboutServletTest
[INFO] Tests run: 1, Failures: 0, Errors: 0, Skipped: 0, Time elapsed: 0 s - in jmri.web.servlet.about.AboutServletTest
[INFO] Running jmri.web.servlet.about.BundleTest
[INFO] Tests run: 6, Failures: 0, Errors: 0, Skipped: 0, Time elapsed: 0.01 s - in jmri.web.servlet.about.BundleTest
[INFO] Running jmri.web.servlet.json.JsonServletTest
[INFO] Tests run: 13, Failures: 0, Errors: 0, Skipped: 0, Time elapsed: 0.104 s - in jmri.web.servlet.json.JsonServletTest
[INFO] Running jmri.web.servlet.json.BundleTest
[INFO] Tests run: 6, Failures: 0, Errors: 0, Skipped: 0, Time elapsed: 0.002 s - in jmri.web.servlet.json.BundleTest
[INFO] Running jmri.web.servlet.json.JsonBundleTest
[INFO] Tests run: 6, Failures: 0, Errors: 0, Skipped: 0, Time elapsed: 0.001 s - in jmri.web.servlet.json.JsonBundleTest
[INFO] Running jmri.web.BundleTest
[INFO] Tests run: 6, Failures: 0, Errors: 0, Skipped: 0, Time elapsed: 0 s - in jmri.web.BundleTest
[INFO] Running jmri.web.server.FrameServletPreferencesPanelTest
[INFO] Tests run: 1, Failures: 0, Errors: 0, Skipped: 0, Time elapsed: 0.602 s - in jmri.web.server.FrameServletPreferencesPanelTest
[INFO] Running jmri.web.server.RailroadNamePreferencesPanelTest
[INFO] Tests run: 1, Failures: 0, Errors: 0, Skipped: 0, Time elapsed: 0.006 s - in jmri.web.server.RailroadNamePreferencesPanelTest
[INFO] Running jmri.web.server.BundleTest
[INFO] Tests run: 6, Failures: 0, Errors: 0, Skipped: 0, Time elapsed: 0.002 s - in jmri.web.server.BundleTest
[INFO] Running jmri.web.server.WebServerActionTest
[INFO] Tests run: 1, Failures: 0, Errors: 0, Skipped: 0, Time elapsed: 0 s - in jmri.web.server.WebServerActionTest
[INFO] Running jmri.web.server.WebServerPreferencesTest
[INFO] Tests run: 1, Failures: 0, Errors: 0, Skipped: 0, Time elapsed: 0.001 s - in jmri.web.server.WebServerPreferencesTest
[INFO] Running jmri.web.server.WebServerTest
[INFO] Tests run: 9, Failures: 0, Errors: 0, Skipped: 0, Time elapsed: 0.229 s - in jmri.web.server.WebServerTest
[INFO] Running jmri.web.server.WebServerPreferencesInstanceInitializerTest
[INFO] Tests run: 2, Failures: 0, Errors: 0, Skipped: 0, Time elapsed: 0.008 s - in jmri.web.server.WebServerPreferencesInstanceInitializerTest
[INFO] Running jmri.web.server.WebServerPreferencesPanelTest
[INFO] Tests run: 1, Failures: 0, Errors: 0, Skipped: 0, Time elapsed: 0.035 s - in jmri.web.server.WebServerPreferencesPanelTest
[INFO] Running jmri.plaf.macosx.Jdk9ApplicationTest
[INFO] Tests run: 1, Failures: 0, Errors: 0, Skipped: 0, Time elapsed: 0.005 s - in jmri.plaf.macosx.Jdk9ApplicationTest
[INFO] Running jmri.plaf.macosx.EawtApplicationTest
[WARNING] Tests run: 2, Failures: 0, Errors: 0, Skipped: 1, Time elapsed: 0.006 s - in jmri.plaf.macosx.EawtApplicationTest
[INFO] Running jmri.BooleanPropertyDescriptorTest
[INFO] Tests run: 1, Failures: 0, Errors: 0, Skipped: 0, Time elapsed: 0.008 s - in jmri.BooleanPropertyDescriptorTest
[INFO] Running jmri.BlockTest
[INFO] Tests run: 18, Failures: 0, Errors: 0, Skipped: 0, Time elapsed: 0.025 s - in jmri.BlockTest
[INFO] Running jmri.ConditionalVariableTest
[INFO] Tests run: 15, Failures: 0, Errors: 0, Skipped: 0, Time elapsed: 0.211 s - in jmri.ConditionalVariableTest
[INFO] Running jmri.ProgReadExceptionTest
[INFO] Tests run: 2, Failures: 0, Errors: 0, Skipped: 0, Time elapsed: 0.001 s - in jmri.ProgReadExceptionTest
[INFO] Running jmri.implementation.SensorGroupConditionalTest
[INFO] Tests run: 1, Failures: 0, Errors: 0, Skipped: 0, Time elapsed: 0 s - in jmri.implementation.SensorGroupConditionalTest
[INFO] Running jmri.implementation.DoubleTurnoutSignalHeadTest
[INFO] Tests run: 15, Failures: 0, Errors: 0, Skipped: 0, Time elapsed: 1.98 s - in jmri.implementation.DoubleTurnoutSignalHeadTest
[INFO] Running jmri.implementation.DccSignalHeadTest
[INFO] Tests run: 20, Failures: 0, Errors: 0, Skipped: 0, Time elapsed: 0.014 s - in jmri.implementation.DccSignalHeadTest
[INFO] Running jmri.implementation.configurexml.QuadOutputSignalHeadXmlTest
[INFO] Tests run: 1, Failures: 0, Errors: 0, Skipped: 0, Time elapsed: 0 s - in jmri.implementation.configurexml.QuadOutputSignalHeadXmlTest
[INFO] Running jmri.implementation.configurexml.TripleOutputSignalHeadXmlTest
[INFO] Tests run: 1, Failures: 0, Errors: 0, Skipped: 0, Time elapsed: 0 s - in jmri.implementation.configurexml.TripleOutputSignalHeadXmlTest
[INFO] Running jmri.implementation.configurexml.SE8cSignalHeadXmlTest
[INFO] Tests run: 1, Failures: 0, Errors: 0, Skipped: 0, Time elapsed: 0 s - in jmri.implementation.configurexml.SE8cSignalHeadXmlTest
[INFO] Running jmri.implementation.configurexml.TurnoutSignalMastXmlTest
[INFO] Tests run: 1, Failures: 0, Errors: 0, Skipped: 0, Time elapsed: 0 s - in jmri.implementation.configurexml.TurnoutSignalMastXmlTest
[INFO] Running jmri.implementation.configurexml.LoadAndStoreTest
[INFO] Tests run: 8, Failures: 0, Errors: 0, Skipped: 0, Time elapsed: 3.342 s - in jmri.implementation.configurexml.LoadAndStoreTest
[INFO] Running jmri.implementation.configurexml.DccSignalHeadXmlTest
[INFO] Tests run: 1, Failures: 0, Errors: 0, Skipped: 0, Time elapsed: 0.001 s - in jmri.implementation.configurexml.DccSignalHeadXmlTest
[INFO] Running jmri.implementation.configurexml.MatrixSignalMastXmlTest
[INFO] Tests run: 1, Failures: 0, Errors: 0, Skipped: 0, Time elapsed: 0 s - in jmri.implementation.configurexml.MatrixSignalMastXmlTest
[INFO] Running jmri.implementation.configurexml.LsDecSignalHeadXmlTest
[INFO] Tests run: 1, Failures: 0, Errors: 0, Skipped: 0, Time elapsed: 0 s - in jmri.implementation.configurexml.LsDecSignalHeadXmlTest
[INFO] Running jmri.implementation.configurexml.DoubleTurnoutSignalHeadXmlTest
[INFO] Tests run: 1, Failures: 0, Errors: 0, Skipped: 0, Time elapsed: 0 s - in jmri.implementation.configurexml.DoubleTurnoutSignalHeadXmlTest
[INFO] Running jmri.implementation.configurexml.SignalHeadSignalMastXmlTest
[INFO] Tests run: 1, Failures: 0, Errors: 0, Skipped: 0, Time elapsed: 0 s - in jmri.implementation.configurexml.SignalHeadSignalMastXmlTest
[INFO] Running jmri.implementation.configurexml.SchemaTest
[INFO] Tests run: 8, Failures: 0, Errors: 0, Skipped: 0, Time elapsed: 1.454 s - in jmri.implementation.configurexml.SchemaTest
[INFO] Running jmri.implementation.configurexml.MergSD2SignalHeadXmlTest
[INFO] Tests run: 1, Failures: 0, Errors: 0, Skipped: 0, Time elapsed: 0 s - in jmri.implementation.configurexml.MergSD2SignalHeadXmlTest
[INFO] Running jmri.implementation.configurexml.TripleTurnoutSignalHeadXmlTest
[INFO] Tests run: 1, Failures: 0, Errors: 0, Skipped: 0, Time elapsed: 0 s - in jmri.implementation.configurexml.TripleTurnoutSignalHeadXmlTest
[INFO] Running jmri.implementation.configurexml.VirtualSignalHeadXmlTest
[INFO] Tests run: 1, Failures: 0, Errors: 0, Skipped: 0, Time elapsed: 0 s - in jmri.implementation.configurexml.VirtualSignalHeadXmlTest
[INFO] Running jmri.implementation.configurexml.DccSignalMastXmlTest
[INFO] Tests run: 1, Failures: 0, Errors: 0, Skipped: 0, Time elapsed: 0 s - in jmri.implementation.configurexml.DccSignalMastXmlTest
[INFO] Running jmri.implementation.configurexml.VirtualSignalMastXmlTest
[INFO] Tests run: 1, Failures: 0, Errors: 0, Skipped: 0, Time elapsed: 0 s - in jmri.implementation.configurexml.VirtualSignalMastXmlTest
[INFO] Running jmri.implementation.configurexml.SingleTurnoutSignalHeadXmlTest
[INFO] Tests run: 1, Failures: 0, Errors: 0, Skipped: 0, Time elapsed: 0 s - in jmri.implementation.configurexml.SingleTurnoutSignalHeadXmlTest
[INFO] Running jmri.implementation.AddressedHighCvProgrammerFacadeTest
[INFO] Tests run: 5, Failures: 0, Errors: 0, Skipped: 0, Time elapsed: 1.613 s - in jmri.implementation.AddressedHighCvProgrammerFacadeTest
[INFO] Running jmri.implementation.OffsetHighCvProgrammerFacadeTest
[INFO] Tests run: 4, Failures: 0, Errors: 0, Skipped: 0, Time elapsed: 1.22 s - in jmri.implementation.OffsetHighCvProgrammerFacadeTest
[INFO] Running jmri.implementation.JmriMultiStatePropertyListenerTest
[INFO] Tests run: 1, Failures: 0, Errors: 0, Skipped: 0, Time elapsed: 0 s - in jmri.implementation.JmriMultiStatePropertyListenerTest
[INFO] Running jmri.implementation.AbstractAudioTest
[INFO] Tests run: 3, Failures: 0, Errors: 0, Skipped: 0, Time elapsed: 0.002 s - in jmri.implementation.AbstractAudioTest
[INFO] Running jmri.implementation.NamedBeanTest
[INFO] Tests run: 5, Failures: 0, Errors: 0, Skipped: 0, Time elapsed: 0.002 s - in jmri.implementation.NamedBeanTest
[INFO] Running jmri.implementation.swing.BundleTest
[INFO] Tests run: 6, Failures: 0, Errors: 0, Skipped: 0, Time elapsed: 0.009 s - in jmri.implementation.swing.BundleTest
[INFO] Running jmri.implementation.swing.SwingShutDownTaskTest
[INFO] Tests run: 3, Failures: 0, Errors: 0, Skipped: 0, Time elapsed: 0.004 s - in jmri.implementation.swing.SwingShutDownTaskTest
[INFO] Running jmri.implementation.DefaultRailComTest
[INFO] Tests run: 9, Failures: 0, Errors: 0, Skipped: 0, Time elapsed: 0.042 s - in jmri.implementation.DefaultRailComTest
[INFO] Running jmri.implementation.ActiveLogixTest
[INFO] Tests run: 5, Failures: 0, Errors: 0, Skipped: 0, Time elapsed: 0.198 s - in jmri.implementation.ActiveLogixTest
[INFO] Running jmri.implementation.SensorTurnoutOperatorTest
[INFO] Tests run: 1, Failures: 0, Errors: 0, Skipped: 0, Time elapsed: 0.005 s - in jmri.implementation.SensorTurnoutOperatorTest
[INFO] Running jmri.implementation.SignalSystemFileCheckTest
[INFO] Tests run: 481, Failures: 0, Errors: 0, Skipped: 0, Time elapsed: 73.492 s - in jmri.implementation.SignalSystemFileCheckTest
[INFO] Running jmri.implementation.VerifyWriteProgrammerFacadeTest
[INFO] Tests run: 3, Failures: 0, Errors: 0, Skipped: 0, Time elapsed: 0.806 s - in jmri.implementation.VerifyWriteProgrammerFacadeTest
[INFO] Running jmri.implementation.SignalSpeedMapTest
[INFO] Tests run: 5, Failures: 0, Errors: 0, Skipped: 0, Time elapsed: 0.017 s - in jmri.implementation.SignalSpeedMapTest
[INFO] Running jmri.implementation.ResettingOffsetHighCvProgrammerFacadeTest
[INFO] Tests run: 4, Failures: 0, Errors: 0, Skipped: 0, Time elapsed: 1.019 s - in jmri.implementation.ResettingOffsetHighCvProgrammerFacadeTest
[INFO] Running jmri.implementation.TwoIndexTcsProgrammerFacadeTest
[INFO] Tests run: 4, Failures: 0, Errors: 0, Skipped: 0, Time elapsed: 3.816 s - in jmri.implementation.TwoIndexTcsProgrammerFacadeTest
[INFO] Running jmri.implementation.DefaultIdTagTest
[INFO] Tests run: 7, Failures: 0, Errors: 0, Skipped: 0, Time elapsed: 0.017 s - in jmri.implementation.DefaultIdTagTest
[INFO] Running jmri.implementation.VirtualSignalHeadTest
[INFO] Tests run: 11, Failures: 0, Errors: 0, Skipped: 0, Time elapsed: 0.005 s - in jmri.implementation.VirtualSignalHeadTest
[INFO] Running jmri.implementation.DefaultSignalAppearanceMapTest
[INFO] Tests run: 7, Failures: 0, Errors: 0, Skipped: 0, Time elapsed: 0.132 s - in jmri.implementation.DefaultSignalAppearanceMapTest
[INFO] Running jmri.implementation.JmriTwoStatePropertyListenerTest
[INFO] Tests run: 1, Failures: 0, Errors: 0, Skipped: 0, Time elapsed: 0 s - in jmri.implementation.JmriTwoStatePropertyListenerTest
[INFO] Running jmri.implementation.DccConsistTest
[INFO] Tests run: 15, Failures: 0, Errors: 0, Skipped: 0, Time elapsed: 13.439 s - in jmri.implementation.DccConsistTest
[INFO] Running jmri.implementation.RawTurnoutOperatorTest
[INFO] Tests run: 1, Failures: 0, Errors: 0, Skipped: 0, Time elapsed: 0.001 s - in jmri.implementation.RawTurnoutOperatorTest
[INFO] Running jmri.implementation.BundleTest
[INFO] Tests run: 6, Failures: 0, Errors: 0, Skipped: 0, Time elapsed: 0 s - in jmri.implementation.BundleTest
[INFO] Running jmri.implementation.JmriConfigurationManagerTest
[INFO] Tests run: 1, Failures: 0, Errors: 0, Skipped: 0, Time elapsed: 0 s - in jmri.implementation.JmriConfigurationManagerTest
[INFO] Running jmri.implementation.SE8cSignalHeadTest
[INFO] Tests run: 18, Failures: 0, Errors: 0, Skipped: 0, Time elapsed: 0.015 s - in jmri.implementation.SE8cSignalHeadTest
[INFO] Running jmri.implementation.OpsModeDelayedProgrammerFacadeTest
[INFO] Tests run: 5, Failures: 0, Errors: 0, Skipped: 0, Time elapsed: 3.207 s - in jmri.implementation.OpsModeDelayedProgrammerFacadeTest
[INFO] Running jmri.implementation.DefaultSignalMastLogicTest
[INFO] Tests run: 1, Failures: 0, Errors: 0, Skipped: 0, Time elapsed: 0.042 s - in jmri.implementation.DefaultSignalMastLogicTest
[INFO] Running jmri.implementation.JmriMemoryPropertyListenerTest
[INFO] Tests run: 1, Failures: 0, Errors: 0, Skipped: 0, Time elapsed: 0 s - in jmri.implementation.JmriMemoryPropertyListenerTest
[INFO] Running jmri.implementation.DefaultConditionalTest
[WARNING] Tests run: 10, Failures: 0, Errors: 0, Skipped: 1, Time elapsed: 0.043 s - in jmri.implementation.DefaultConditionalTest
[INFO] Running jmri.implementation.TripleTurnoutSignalHeadTest
[INFO] Tests run: 11, Failures: 0, Errors: 0, Skipped: 0, Time elapsed: 0.007 s - in jmri.implementation.TripleTurnoutSignalHeadTest
[INFO] Running jmri.implementation.DefaultClockControlTest
[INFO] Tests run: 2, Failures: 0, Errors: 0, Skipped: 0, Time elapsed: 0 s - in jmri.implementation.DefaultClockControlTest
[INFO] Running jmri.implementation.ProgrammerFacadeSelectorTest
[INFO] Tests run: 1, Failures: 0, Errors: 0, Skipped: 0, Time elapsed: 0 s - in jmri.implementation.ProgrammerFacadeSelectorTest
[INFO] Running jmri.implementation.AbstractInstanceInitializerTest
[INFO] Tests run: 1, Failures: 0, Errors: 0, Skipped: 0, Time elapsed: 0.001 s - in jmri.implementation.AbstractInstanceInitializerTest
[INFO] Running jmri.implementation.MatrixSignalMastTest
[INFO] Tests run: 8, Failures: 0, Errors: 0, Skipped: 0, Time elapsed: 0.26 s - in jmri.implementation.MatrixSignalMastTest
[INFO] Running jmri.implementation.DefaultLogixTest
[INFO] Tests run: 8, Failures: 0, Errors: 0, Skipped: 0, Time elapsed: 0.007 s - in jmri.implementation.DefaultLogixTest
[INFO] Running jmri.implementation.TripleOutputSignalHeadTest
[INFO] Tests run: 11, Failures: 0, Errors: 0, Skipped: 0, Time elapsed: 0.008 s - in jmri.implementation.TripleOutputSignalHeadTest
[INFO] Running jmri.implementation.LsDecSignalHeadTest
[INFO] Tests run: 11, Failures: 0, Errors: 0, Skipped: 0, Time elapsed: 0.006 s - in jmri.implementation.LsDecSignalHeadTest
[INFO] Running jmri.implementation.DefaultMemoryTest
[INFO] Tests run: 4, Failures: 0, Errors: 0, Skipped: 0, Time elapsed: 0 s - in jmri.implementation.DefaultMemoryTest
[INFO] Running jmri.implementation.VirtualSignalMastTest
[INFO] Tests run: 1, Failures: 0, Errors: 0, Skipped: 0, Time elapsed: 0.037 s - in jmri.implementation.VirtualSignalMastTest
[INFO] Running jmri.implementation.DccConsistManagerTest
[WARNING] Tests run: 12, Failures: 0, Errors: 0, Skipped: 1, Time elapsed: 0.006 s - in jmri.implementation.DccConsistManagerTest
[INFO] Running jmri.implementation.SingleTurnoutSignalHeadTest
[INFO] Tests run: 13, Failures: 0, Errors: 0, Skipped: 0, Time elapsed: 0.008 s - in jmri.implementation.SingleTurnoutSignalHeadTest
[INFO] Running jmri.implementation.FileLocationsPreferencesTest
[INFO] Tests run: 1, Failures: 0, Errors: 0, Skipped: 0, Time elapsed: 0 s - in jmri.implementation.FileLocationsPreferencesTest
[INFO] Running jmri.implementation.ReporterTest
[INFO] Tests run: 3, Failures: 0, Errors: 0, Skipped: 0, Time elapsed: 0.003 s - in jmri.implementation.ReporterTest
[INFO] Running jmri.implementation.SignalMastRepeaterTest
[INFO] Tests run: 1, Failures: 0, Errors: 0, Skipped: 0, Time elapsed: 0.036 s - in jmri.implementation.SignalMastRepeaterTest
[INFO] Running jmri.implementation.AbstractSensorTest
[INFO] Tests run: 14, Failures: 0, Errors: 0, Skipped: 0, Time elapsed: 0.126 s - in jmri.implementation.AbstractSensorTest
[INFO] Running jmri.implementation.AccessoryOpsModeProgrammerFacadeTest
[INFO] Tests run: 4, Failures: 0, Errors: 0, Skipped: 0, Time elapsed: 0.616 s - in jmri.implementation.AccessoryOpsModeProgrammerFacadeTest
[INFO] Running jmri.implementation.RouteTest
[INFO] Tests run: 9, Failures: 0, Errors: 0, Skipped: 0, Time elapsed: 0.006 s - in jmri.implementation.RouteTest
[INFO] Running jmri.implementation.DefaultSignalGroupTest
[INFO] Tests run: 1, Failures: 0, Errors: 0, Skipped: 0, Time elapsed: 0 s - in jmri.implementation.DefaultSignalGroupTest
[INFO] Running jmri.implementation.MultiIndexProgrammerFacadeTest
[INFO] Tests run: 17, Failures: 0, Errors: 0, Skipped: 0, Time elapsed: 8.872 s - in jmri.implementation.MultiIndexProgrammerFacadeTest
[INFO] Running jmri.implementation.NoFeedbackTurnoutOperatorTest
[INFO] Tests run: 1, Failures: 0, Errors: 0, Skipped: 0, Time elapsed: 0.002 s - in jmri.implementation.NoFeedbackTurnoutOperatorTest
[INFO] Running jmri.implementation.DccSignalMastTest
[INFO] Tests run: 2, Failures: 0, Errors: 0, Skipped: 0, Time elapsed: 0.078 s - in jmri.implementation.DccSignalMastTest
[INFO] Running jmri.implementation.DefaultConditionalActionTest
[INFO] Tests run: 8, Failures: 0, Errors: 0, Skipped: 0, Time elapsed: 0.055 s - in jmri.implementation.DefaultConditionalActionTest
[INFO] Running jmri.implementation.MergSD2SignalHeadTest
[INFO] Tests run: 11, Failures: 0, Errors: 0, Skipped: 0, Time elapsed: 0.007 s - in jmri.implementation.MergSD2SignalHeadTest
[INFO] Running jmri.implementation.SignalHeadSignalMastTest
[INFO] Tests run: 17, Failures: 0, Errors: 0, Skipped: 0, Time elapsed: 1.773 s - in jmri.implementation.SignalHeadSignalMastTest
[INFO] Running jmri.implementation.JmriSimplePropertyListenerTest
[INFO] Tests run: 1, Failures: 0, Errors: 0, Skipped: 0, Time elapsed: 0 s - in jmri.implementation.JmriSimplePropertyListenerTest
[INFO] Running jmri.implementation.DefaultCabSignalTest
[INFO] Tests run: 2, Failures: 0, Errors: 0, Skipped: 0, Time elapsed: 0.001 s - in jmri.implementation.DefaultCabSignalTest
[INFO] Running jmri.implementation.DefaultRouteTest
[INFO] Tests run: 1, Failures: 0, Errors: 0, Skipped: 0, Time elapsed: 0 s - in jmri.implementation.DefaultRouteTest
[INFO] Running jmri.implementation.AbstractStringIOTest
[INFO] Tests run: 5, Failures: 0, Errors: 0, Skipped: 0, Time elapsed: 0.004 s - in jmri.implementation.AbstractStringIOTest
[INFO] Running jmri.implementation.QuadOutputSignalHeadTest
[INFO] Tests run: 11, Failures: 0, Errors: 0, Skipped: 0, Time elapsed: 0.008 s - in jmri.implementation.QuadOutputSignalHeadTest
[INFO] Running jmri.implementation.TurnoutSignalMastTest
[INFO] Tests run: 5, Failures: 0, Errors: 0, Skipped: 0, Time elapsed: 0.195 s - in jmri.implementation.TurnoutSignalMastTest
[INFO] Running jmri.implementation.DefaultSignalSystemTest
[INFO] Tests run: 12, Failures: 0, Errors: 0, Skipped: 0, Time elapsed: 0.006 s - in jmri.implementation.DefaultSignalSystemTest
[INFO] Running jmri.implementation.LightControlTest
[INFO] Tests run: 21, Failures: 0, Errors: 0, Skipped: 0, Time elapsed: 0.082 s - in jmri.implementation.LightControlTest
[INFO] Running jmri.implementation.NmraConsistTest
[INFO] Tests run: 15, Failures: 0, Errors: 0, Skipped: 0, Time elapsed: 13.276 s - in jmri.implementation.NmraConsistTest
[INFO] Running jmri.implementation.NmraConsistManagerTest
[WARNING] Tests run: 12, Failures: 0, Errors: 0, Skipped: 1, Time elapsed: 0.006 s - in jmri.implementation.NmraConsistManagerTest
[INFO] Running jmri.implementation.JmriClockPropertyListenerTest
[INFO] Tests run: 1, Failures: 0, Errors: 0, Skipped: 0, Time elapsed: 0 s - in jmri.implementation.JmriClockPropertyListenerTest
[INFO] Running jmri.implementation.AbstractRailComReporterTest
[INFO] Tests run: 5, Failures: 0, Errors: 0, Skipped: 0, Time elapsed: 0.015 s - in jmri.implementation.AbstractRailComReporterTest
[INFO] Running jmri.ScaleTest
[INFO] Tests run: 5, Failures: 0, Errors: 0, Skipped: 0, Time elapsed: 0.023 s - in jmri.ScaleTest
[INFO] Running jmri.EntryPointTest
[INFO] Tests run: 1, Failures: 0, Errors: 0, Skipped: 0, Time elapsed: 0 s - in jmri.EntryPointTest
[INFO] Running jmri.NamedBeanHandleTest
[INFO] Tests run: 1, Failures: 0, Errors: 0, Skipped: 0, Time elapsed: 0 s - in jmri.NamedBeanHandleTest
[INFO] Running apps.DispatcherPro.BundleTest
[INFO] Tests run: 4, Failures: 0, Errors: 0, Skipped: 0, Time elapsed: 0 s - in apps.DispatcherPro.BundleTest
[INFO] Running apps.DispatcherPro.DispatcherProTest
[WARNING] Tests run: 1, Failures: 0, Errors: 0, Skipped: 1, Time elapsed: 0 s - in apps.DispatcherPro.DispatcherProTest
[INFO] Running apps.configurexml.SystemConsoleConfigPanelXmlTest
[INFO] Tests run: 1, Failures: 0, Errors: 0, Skipped: 0, Time elapsed: 0 s - in apps.configurexml.SystemConsoleConfigPanelXmlTest
[INFO] Running apps.configurexml.FileLocationPaneXmlTest
[INFO] Tests run: 1, Failures: 0, Errors: 0, Skipped: 0, Time elapsed: 0 s - in apps.configurexml.FileLocationPaneXmlTest
[INFO] Running apps.configurexml.GuiLafConfigPaneXmlTest
[INFO] Tests run: 1, Failures: 0, Errors: 0, Skipped: 0, Time elapsed: 0.001 s - in apps.configurexml.GuiLafConfigPaneXmlTest
[INFO] Running apps.configurexml.CreateButtonModelXmlTest
[INFO] Tests run: 1, Failures: 0, Errors: 0, Skipped: 0, Time elapsed: 0 s - in apps.configurexml.CreateButtonModelXmlTest
[INFO] Running apps.configurexml.PerformScriptModelXmlTest
[INFO] Tests run: 1, Failures: 0, Errors: 0, Skipped: 0, Time elapsed: 0 s - in apps.configurexml.PerformScriptModelXmlTest
[INFO] Running apps.configurexml.ManagerDefaultsConfigPaneXmlTest
[INFO] Tests run: 1, Failures: 0, Errors: 0, Skipped: 0, Time elapsed: 0 s - in apps.configurexml.ManagerDefaultsConfigPaneXmlTest
[INFO] Running apps.configurexml.PerformFileModelXmlTest
[INFO] Tests run: 1, Failures: 0, Errors: 0, Skipped: 0, Time elapsed: 0 s - in apps.configurexml.PerformFileModelXmlTest
[INFO] Running apps.configurexml.PerformActionModelXmlTest
[INFO] Tests run: 1, Failures: 0, Errors: 0, Skipped: 0, Time elapsed: 0 s - in apps.configurexml.PerformActionModelXmlTest
[INFO] Running apps.SplashWindowTest
[INFO] Tests run: 1, Failures: 0, Errors: 0, Skipped: 0, Time elapsed: 0.013 s - in apps.SplashWindowTest
[INFO] Running apps.SystemConsoleActionTest
[INFO] Tests run: 1, Failures: 0, Errors: 0, Skipped: 0, Time elapsed: 0 s - in apps.SystemConsoleActionTest
[INFO] Running apps.RestartStartupActionFactoryTest
[INFO] Tests run: 1, Failures: 0, Errors: 0, Skipped: 0, Time elapsed: 0 s - in apps.RestartStartupActionFactoryTest
[INFO] Running apps.SystemConsoleConfigPanelTest
[INFO] Tests run: 1, Failures: 0, Errors: 0, Skipped: 0, Time elapsed: 0.033 s - in apps.SystemConsoleConfigPanelTest
[INFO] Running apps.FileLocationPaneTest
[INFO] Tests run: 1, Failures: 0, Errors: 0, Skipped: 0, Time elapsed: 0.021 s - in apps.FileLocationPaneTest
[INFO] Running apps.InstallTest.BundleTest
[INFO] Tests run: 4, Failures: 0, Errors: 0, Skipped: 0, Time elapsed: 0 s - in apps.InstallTest.BundleTest
[INFO] Running apps.InstallTest.InstallTestTest
[WARNING] Tests run: 1, Failures: 0, Errors: 0, Skipped: 1, Time elapsed: 0 s - in apps.InstallTest.InstallTestTest
[INFO] Running apps.systemconsole.SystemConsolePreferencesManagerTest
[INFO] Tests run: 1, Failures: 0, Errors: 0, Skipped: 0, Time elapsed: 0 s - in apps.systemconsole.SystemConsolePreferencesManagerTest
[INFO] Running apps.AboutActionTest
[INFO] Tests run: 1, Failures: 0, Errors: 0, Skipped: 0, Time elapsed: 0 s - in apps.AboutActionTest
[INFO] Running apps.PerformScriptModelTest
[INFO] Tests run: 1, Failures: 0, Errors: 0, Skipped: 0, Time elapsed: 0 s - in apps.PerformScriptModelTest
[INFO] Running apps.StartupActionsManagerTest
[INFO] Tests run: 1, Failures: 0, Errors: 0, Skipped: 0, Time elapsed: 0 s - in apps.StartupActionsManagerTest
[INFO] Running apps.AppsLaunchFrameTest
[INFO] Tests run: 1, Failures: 0, Errors: 0, Skipped: 0, Time elapsed: 0.078 s - in apps.AppsLaunchFrameTest
[INFO] Running apps.PerformFileModelTest
[INFO] Tests run: 1, Failures: 0, Errors: 0, Skipped: 0, Time elapsed: 0 s - in apps.PerformFileModelTest
[INFO] Running apps.BundleTest
[INFO] Tests run: 4, Failures: 0, Errors: 0, Skipped: 0, Time elapsed: 0 s - in apps.BundleTest
[INFO] Running apps.DecoderPro.DecoderProActionTest
[INFO] Tests run: 1, Failures: 0, Errors: 0, Skipped: 0, Time elapsed: 0.002 s - in apps.DecoderPro.DecoderProActionTest
[INFO] Running apps.DecoderPro.BundleTest
[INFO] Tests run: 4, Failures: 0, Errors: 0, Skipped: 0, Time elapsed: 0 s - in apps.DecoderPro.BundleTest
[INFO] Running apps.DecoderPro.DecoderProTest
[WARNING] Tests run: 1, Failures: 0, Errors: 0, Skipped: 1, Time elapsed: 0 s - in apps.DecoderPro.DecoderProTest
[INFO] Running apps.DecoderPro.DecoderProPaneTest
[INFO] Tests run: 1, Failures: 0, Errors: 0, Skipped: 0, Time elapsed: 0.016 s - in apps.DecoderPro.DecoderProPaneTest
[INFO] Running apps.gui.GuiLafPreferencesManagerTest
[INFO] Tests run: 1, Failures: 0, Errors: 0, Skipped: 0, Time elapsed: 0 s - in apps.gui.GuiLafPreferencesManagerTest
[INFO] Running apps.SystemConsoleTest
[INFO] Tests run: 1, Failures: 0, Errors: 0, Skipped: 0, Time elapsed: 0 s - in apps.SystemConsoleTest
[INFO] Running apps.AppsTest
[WARNING] Tests run: 1, Failures: 0, Errors: 0, Skipped: 1, Time elapsed: 0.001 s - in apps.AppsTest
[INFO] Running apps.ValidateConfigFilesTest
[INFO] Tests run: 15, Failures: 0, Errors: 0, Skipped: 0, Time elapsed: 2.081 s - in apps.ValidateConfigFilesTest
[INFO] Running apps.LicenseActionTest
[INFO] Tests run: 1, Failures: 0, Errors: 0, Skipped: 0, Time elapsed: 0 s - in apps.LicenseActionTest
[INFO] Running apps.PerformActionModelTest
[INFO] Tests run: 1, Failures: 0, Errors: 0, Skipped: 0, Time elapsed: 0 s - in apps.PerformActionModelTest
[INFO] Running apps.gui3.paned.PanelProActionTest
[INFO] Tests run: 1, Failures: 0, Errors: 0, Skipped: 0, Time elapsed: 0 s - in apps.gui3.paned.PanelProActionTest
[INFO] Running apps.gui3.paned.PanedTest
INFO  - JMRI GUI3 Demo version 4.19.3ish+jenkins+2020-01-24T01:31:31Z+R03bf4ad starts under Java 1.8.0_181 on Linux amd64 v4.4.0-112-generic at Fri Jan 24 02:06:51 GMT 2020 [main] apps.AppsBase.preInit()
INFO  - No pre-existing config file found, searched for '/var/lib/jenkins/jobs/Development/jobs/PIT/workspace/temp/DecoderProConfig3.xml' [main] apps.AppsBase.setAndLoadPreferenceFile()
[INFO] Tests run: 1, Failures: 0, Errors: 0, Skipped: 0, Time elapsed: 0.14 s - in apps.gui3.paned.PanedTest
[INFO] Running apps.gui3.paned.PanelProFrameTest
[INFO] Tests run: 1, Failures: 0, Errors: 0, Skipped: 0, Time elapsed: 0.049 s - in apps.gui3.paned.PanelProFrameTest
[INFO] Running apps.gui3.paned.QuitActionTest
[INFO] Tests run: 1, Failures: 0, Errors: 0, Skipped: 0, Time elapsed: 0.001 s - in apps.gui3.paned.QuitActionTest
[INFO] Running apps.gui3.dp3.DecoderPro3PanesTest
[INFO] Tests run: 1, Failures: 0, Errors: 0, Skipped: 0, Time elapsed: 0.002 s - in apps.gui3.dp3.DecoderPro3PanesTest
[INFO] Running apps.gui3.dp3.DecoderPro3Test
INFO  - No pre-existing config file found, searched for '/var/lib/jenkins/jobs/Development/jobs/PIT/workspace/temp/DecoderProConfig3.xml' [main] apps.AppsBase.setAndLoadPreferenceFile()
[INFO] Tests run: 1, Failures: 0, Errors: 0, Skipped: 0, Time elapsed: 0.067 s - in apps.gui3.dp3.DecoderPro3Test
[INFO] Running apps.gui3.dp3.BundleTest
[INFO] Tests run: 4, Failures: 0, Errors: 0, Skipped: 0, Time elapsed: 0.004 s - in apps.gui3.dp3.BundleTest
[INFO] Running apps.gui3.dp3.PaneProgDp3ActionTest
[INFO] Tests run: 1, Failures: 0, Errors: 0, Skipped: 0, Time elapsed: 0.008 s - in apps.gui3.dp3.PaneProgDp3ActionTest
[INFO] Running apps.gui3.dp3.DecoderPro3WindowTest
[INFO] Tests run: 1, Failures: 0, Errors: 0, Skipped: 0, Time elapsed: 0.116 s - in apps.gui3.dp3.DecoderPro3WindowTest
[INFO] Running apps.gui3.dp3.DecoderPro3ActionTest
[INFO] Tests run: 2, Failures: 0, Errors: 0, Skipped: 0, Time elapsed: 0.001 s - in apps.gui3.dp3.DecoderPro3ActionTest
[INFO] Running apps.gui3.BundleTest
[INFO] Tests run: 4, Failures: 0, Errors: 0, Skipped: 0, Time elapsed: 0 s - in apps.gui3.BundleTest
[INFO] Running apps.gui3.tabbedpreferences.BundleTest
[INFO] Tests run: 4, Failures: 0, Errors: 0, Skipped: 0, Time elapsed: 0 s - in apps.gui3.tabbedpreferences.BundleTest
[INFO] Running apps.gui3.tabbedpreferences.EditConnectionPreferencesDialogTest
[INFO] Tests run: 1, Failures: 0, Errors: 0, Skipped: 0, Time elapsed: 1.234 s - in apps.gui3.tabbedpreferences.EditConnectionPreferencesDialogTest
[INFO] Running apps.gui3.tabbedpreferences.TabbedPreferencesActionTest
[INFO] Tests run: 1, Failures: 0, Errors: 0, Skipped: 0, Time elapsed: 0 s - in apps.gui3.tabbedpreferences.TabbedPreferencesActionTest
[INFO] Running apps.gui3.tabbedpreferences.TabbedPreferencesFrameTest
[INFO] Tests run: 1, Failures: 0, Errors: 0, Skipped: 0, Time elapsed: 1.023 s - in apps.gui3.tabbedpreferences.TabbedPreferencesFrameTest
[INFO] Running apps.gui3.tabbedpreferences.TabbedPreferencesTest
[INFO] Tests run: 4, Failures: 0, Errors: 0, Skipped: 0, Time elapsed: 3.934 s - in apps.gui3.tabbedpreferences.TabbedPreferencesTest
[INFO] Running apps.gui3.tabbedpreferences.TabbedPreferencesProfileActionTest
[INFO] Tests run: 1, Failures: 0, Errors: 0, Skipped: 0, Time elapsed: 0 s - in apps.gui3.tabbedpreferences.TabbedPreferencesProfileActionTest
[INFO] Running apps.gui3.FirstTimeStartUpWizardTest
INFO  - No pre-existing config file found, searched for '/var/lib/jenkins/jobs/Development/jobs/PIT/workspace/temp/DecoderProConfig3.xml' [main] apps.AppsBase.setAndLoadPreferenceFile()
[INFO] Tests run: 1, Failures: 0, Errors: 0, Skipped: 0, Time elapsed: 0.102 s - in apps.gui3.FirstTimeStartUpWizardTest
[INFO] Running apps.gui3.FirstTimeStartUpWizardActionTest
[INFO] Tests run: 1, Failures: 0, Errors: 0, Skipped: 0, Time elapsed: 0 s - in apps.gui3.FirstTimeStartUpWizardActionTest
[INFO] Running apps.gui3.mdi.MDITest
INFO  - No pre-existing config file found, searched for '/var/lib/jenkins/jobs/Development/jobs/PIT/workspace/temp/DecoderProConfig3.xml' [main] apps.AppsBase.setAndLoadPreferenceFile()
[INFO] Tests run: 1, Failures: 0, Errors: 0, Skipped: 0, Time elapsed: 0.088 s - in apps.gui3.mdi.MDITest
[INFO] Running apps.TrainCrew.InstallFromURLTest
[INFO] Tests run: 1, Failures: 0, Errors: 0, Skipped: 0, Time elapsed: 0 s - in apps.TrainCrew.InstallFromURLTest
[INFO] Running apps.TrainCrew.BundleTest
[INFO] Tests run: 4, Failures: 0, Errors: 0, Skipped: 0, Time elapsed: 0 s - in apps.TrainCrew.BundleTest
[INFO] Running apps.CreateButtonModelTest
[INFO] Tests run: 1, Failures: 0, Errors: 0, Skipped: 0, Time elapsed: 0 s - in apps.CreateButtonModelTest
[INFO] Running apps.ConfigBundleTest
[INFO] Tests run: 4, Failures: 0, Errors: 0, Skipped: 0, Time elapsed: 0 s - in apps.ConfigBundleTest
[INFO] Running apps.JmriFacelessTest
INFO  - No pre-existing config file found, searched for '/var/lib/jenkins/jobs/Development/jobs/PIT/workspace/temp/DecoderProConfig3.xml' [main] apps.AppsBase.setAndLoadPreferenceFile()
[INFO] Tests run: 1, Failures: 0, Errors: 0, Skipped: 0, Time elapsed: 0.005 s - in apps.JmriFacelessTest
[INFO] Running apps.GuiLocalePreferencesPanelTest
[INFO] Tests run: 1, Failures: 0, Errors: 0, Skipped: 0, Time elapsed: 0 s - in apps.GuiLocalePreferencesPanelTest
[INFO] Running apps.SampleMinimalProgramTest
[INFO] Tests run: 1, Failures: 0, Errors: 0, Skipped: 0, Time elapsed: 0.001 s - in apps.SampleMinimalProgramTest
[INFO] Running apps.ManagerDefaultsConfigPaneTest
[INFO] Tests run: 1, Failures: 0, Errors: 0, Skipped: 0, Time elapsed: 0.001 s - in apps.ManagerDefaultsConfigPaneTest
[INFO] Running apps.CheckForUpdateActionTest
[INFO] Tests run: 1, Failures: 0, Errors: 0, Skipped: 0, Time elapsed: 0 s - in apps.CheckForUpdateActionTest
[INFO] Running apps.GuiLafConfigPaneTest
[INFO] Tests run: 1, Failures: 0, Errors: 0, Skipped: 0, Time elapsed: 0.003 s - in apps.GuiLafConfigPaneTest
[INFO] Running apps.RestartActionTest
[INFO] Tests run: 1, Failures: 0, Errors: 0, Skipped: 0, Time elapsed: 0 s - in apps.RestartActionTest
[INFO] Running apps.AppConfigBaseTest
[INFO] Tests run: 1, Failures: 0, Errors: 0, Skipped: 0, Time elapsed: 0 s - in apps.AppConfigBaseTest
[INFO] Running apps.PanelPro.PanelProActionTest
[INFO] Tests run: 1, Failures: 0, Errors: 0, Skipped: 0, Time elapsed: 0 s - in apps.PanelPro.PanelProActionTest
[INFO] Running apps.PanelPro.PanelProTest
[WARNING] Tests run: 1, Failures: 0, Errors: 0, Skipped: 1, Time elapsed: 0 s - in apps.PanelPro.PanelProTest
[INFO] Running apps.PanelPro.BundleTest
[INFO] Tests run: 4, Failures: 0, Errors: 0, Skipped: 0, Time elapsed: 0 s - in apps.PanelPro.BundleTest
[INFO] Running apps.PanelPro.PanelProPaneTest
[INFO] Tests run: 1, Failures: 0, Errors: 0, Skipped: 0, Time elapsed: 0.001 s - in apps.PanelPro.PanelProPaneTest
[INFO] Running apps.startup.StartupPauseFactoryTest
[INFO] Tests run: 1, Failures: 0, Errors: 0, Skipped: 0, Time elapsed: 0 s - in apps.startup.StartupPauseFactoryTest
[INFO] Running apps.startup.PerformFileModelFactoryTest
[INFO] Tests run: 1, Failures: 0, Errors: 0, Skipped: 0, Time elapsed: 0 s - in apps.startup.PerformFileModelFactoryTest
[INFO] Running apps.startup.configurexml.BundleTest
[INFO] Tests run: 4, Failures: 0, Errors: 0, Skipped: 0, Time elapsed: 0 s - in apps.startup.configurexml.BundleTest
[INFO] Running apps.startup.configurexml.TriggerRouteModelXmlTest
[INFO] Tests run: 1, Failures: 0, Errors: 0, Skipped: 0, Time elapsed: 0 s - in apps.startup.configurexml.TriggerRouteModelXmlTest
[INFO] Running apps.startup.configurexml.StartupPauseModelXmlTest
[INFO] Tests run: 1, Failures: 0, Errors: 0, Skipped: 0, Time elapsed: 0 s - in apps.startup.configurexml.StartupPauseModelXmlTest
[INFO] Running apps.startup.configurexml.ScriptButtonModelXmlTest
[INFO] Tests run: 1, Failures: 0, Errors: 0, Skipped: 0, Time elapsed: 0 s - in apps.startup.configurexml.ScriptButtonModelXmlTest
[INFO] Running apps.startup.configurexml.StartupActionsPreferencesPanelXmlTest
[INFO] Tests run: 1, Failures: 0, Errors: 0, Skipped: 0, Time elapsed: 0 s - in apps.startup.configurexml.StartupActionsPreferencesPanelXmlTest
[INFO] Running apps.startup.ScriptButtonModelFactoryTest
[INFO] Tests run: 1, Failures: 0, Errors: 0, Skipped: 0, Time elapsed: 0 s - in apps.startup.ScriptButtonModelFactoryTest
[INFO] Running apps.startup.CreateButtonModelFactoryTest
[INFO] Tests run: 1, Failures: 0, Errors: 0, Skipped: 0, Time elapsed: 0 s - in apps.startup.CreateButtonModelFactoryTest
[INFO] Running apps.startup.StartupModelCellEditorTest
[INFO] Tests run: 1, Failures: 0, Errors: 0, Skipped: 0, Time elapsed: 0 s - in apps.startup.StartupModelCellEditorTest
[INFO] Running apps.startup.ScriptButtonPanelTest
[INFO] Tests run: 1, Failures: 0, Errors: 0, Skipped: 0, Time elapsed: 0.019 s - in apps.startup.ScriptButtonPanelTest
[INFO] Running apps.startup.BundleTest
[INFO] Tests run: 4, Failures: 0, Errors: 0, Skipped: 0, Time elapsed: 0 s - in apps.startup.BundleTest
[INFO] Running apps.startup.StartupModelCellRendererTest
[INFO] Tests run: 1, Failures: 0, Errors: 0, Skipped: 0, Time elapsed: 0 s - in apps.startup.StartupModelCellRendererTest
[INFO] Running apps.startup.TriggerRouteModelFactoryTest
[INFO] Tests run: 1, Failures: 0, Errors: 0, Skipped: 0, Time elapsed: 0 s - in apps.startup.TriggerRouteModelFactoryTest
[INFO] Running apps.startup.TriggerRouteModelTest
[INFO] Tests run: 1, Failures: 0, Errors: 0, Skipped: 0, Time elapsed: 0 s - in apps.startup.TriggerRouteModelTest
[INFO] Running apps.startup.StartupPauseModelTest
[INFO] Tests run: 4, Failures: 0, Errors: 0, Skipped: 0, Time elapsed: 0 s - in apps.startup.StartupPauseModelTest
[INFO] Running apps.startup.AbstractActionModelTest
[INFO] Tests run: 3, Failures: 0, Errors: 0, Skipped: 0, Time elapsed: 0.002 s - in apps.startup.AbstractActionModelTest
[INFO] Running apps.startup.PerformActionModelFactoryTest
[INFO] Tests run: 1, Failures: 0, Errors: 0, Skipped: 0, Time elapsed: 0.001 s - in apps.startup.PerformActionModelFactoryTest
[INFO] Running apps.startup.StartupActionModelUtilTest
[INFO] Tests run: 1, Failures: 0, Errors: 0, Skipped: 0, Time elapsed: 0 s - in apps.startup.StartupActionModelUtilTest
[INFO] Running apps.startup.StartupActionsPreferencesPanelTest
[INFO] Tests run: 1, Failures: 0, Errors: 0, Skipped: 0, Time elapsed: 0.001 s - in apps.startup.StartupActionsPreferencesPanelTest
[INFO] Running apps.startup.AbstractStartupModelTest
[INFO] Tests run: 4, Failures: 0, Errors: 0, Skipped: 0, Time elapsed: 0.001 s - in apps.startup.AbstractStartupModelTest
[INFO] Running apps.startup.ScriptButtonModelTest
[INFO] Tests run: 1, Failures: 0, Errors: 0, Skipped: 0, Time elapsed: 0 s - in apps.startup.ScriptButtonModelTest
[INFO] Running apps.startup.PerformScriptModelFactoryTest
[INFO] Tests run: 1, Failures: 0, Errors: 0, Skipped: 0, Time elapsed: 0.001 s - in apps.startup.PerformScriptModelFactoryTest
[INFO] Running apps.SoundPro.SoundProTest
[WARNING] Tests run: 1, Failures: 0, Errors: 0, Skipped: 1, Time elapsed: 0 s - in apps.SoundPro.SoundProTest
[INFO] Running apps.SoundPro.BundleTest
[INFO] Tests run: 4, Failures: 0, Errors: 0, Skipped: 0, Time elapsed: 0 s - in apps.SoundPro.BundleTest
[INFO] Running apps.ReportContextActionTest
[INFO] Tests run: 1, Failures: 0, Errors: 0, Skipped: 0, Time elapsed: 0 s - in apps.ReportContextActionTest
[INFO] 
[INFO] Results:
[INFO] 
[ERROR] Failures: 
[ERROR]   SchemaTest>SchemaTestBase.tearDown:144 Unexpected ERROR or higher messages emitted: Test jmri.configurexml.SchemaTestBase left ShutDownTask registered: WarrantRosterSpeedProfileCheck (of type class jmri.jmrit.logix.WarrantShutdownTask)}
[INFO] 
[ERROR] Tests run: 42331, Failures: 1, Errors: 0, Skipped: 828
[INFO] 
[ERROR] There are test failures.

Please refer to /var/lib/jenkins/jobs/Development/jobs/PIT/workspace/target/surefire-reports for the individual test results.
Please refer to dump files (if any exist) [date]-jvmRun[N].dump, [date].dumpstream and [date]-jvmRun[N].dumpstream.
[JENKINS] Recording test results
[WARNING] Attempt to (de-)serialize anonymous class hudson.maven.reporters.SurefireArchiver$2; see: https://jenkins.io/redirect/serialization-of-anonymous-classes/
[INFO] 
[INFO] --- pitest-maven:1.4.10:mutationCoverage (default-cli) @ jmri ---
[INFO] Found plugin : Default csv report plugin
[INFO] Found plugin : Default xml report plugin
[INFO] Found plugin : Default html report plugin
[INFO] Found plugin : Static initializer code detector plugin
[INFO] Found plugin : Static initializer filter plugin
[INFO] Found plugin : Excluded annotations plugin
[INFO] Found plugin : Inlined finally block filter plugin
[INFO] Found plugin : Try with resources filter
[INFO] Found plugin : Implicit null check filter
[INFO] Found plugin : Method reference null check filter
[INFO] Found plugin : For each loop filter
[INFO] Found plugin : Logging calls filter
[INFO] Found plugin : Infinite for loop filter
[INFO] Found plugin : Long running iterator loop filter
[INFO] Found plugin : For loop counter filter
[INFO] Found plugin : Kotlin junk mutations filter
[INFO] Found plugin : Max mutations per class limit
[INFO] Found plugin : Equals shortcut equivalent mutant filter
[INFO] Found plugin : Trivial return vals equivalence filter
[INFO] Found plugin : Mutant export plugin
[INFO] Found shared classpath plugin : Default mutation engine
[INFO] Found shared classpath plugin : JUnit plugin
[INFO] Found shared classpath plugin : TestNG plugin
[INFO] Adding org.pitest:pitest to SUT classpath
[INFO] Mutating from /var/lib/jenkins/jobs/Development/jobs/PIT/workspace/target/classes
[INFO] Defaulting target classes to match packages in build directory
2:07:14 AM PIT >> INFO : Verbose logging is disabled. If you encounter a problem, please enable it before reporting an issue.
2:07:21 AM PIT >> INFO : MINION : Picked up JAVA_TOOL_OPTIONS: -Dfile.encoding=UTF-8

2:07:21 AM PIT >> INFO : Sending 12360 test classes to minion
2:07:22 AM PIT >> INFO : Sent tests to minion
2:07:22 AM PIT >> INFO : MINION : 2:07:22 AM PIT >> INFO : Checking environment

2:07:31 AM PIT >> INFO : MINION : 2:07:31 AM PIT >> WARNING : Could not load jmri.script.import.imported$py (NoClassDefFoundError: jmri/script/import/imported$py (wrong name: imported$py))

2:08:38 AM PIT >> INFO : MINION : 2:08:38 AM PIT >> INFO : Found  41785 tests

2:08:38 AM PIT >> INFO : MINION : 2:08:38 AM PIT >> INFO : Dependency analysis reduced number of potential tests by 0

2:08:38 AM PIT >> INFO : MINION : 2:08:38 AM PIT >> INFO : 41785 tests received

/2:08:39 AM PIT >> INFO : MINION : 2:08:39 AM PIT >> WARNING : More threads at end of test (8) testCTor(apps.AppsLaunchFrameTest) than start. (6)

-\|/-\|/-\|/-\|/-\2:08:39 AM PIT >> INFO : MINION : 2:08:39 AM PIT >> WARNING : More threads at end of test (12) testCTor(apps.FileLocationPaneTest) than start. (8)

|/-\|/-\|2:08:39 AM PIT >> WARNING : Error while watching child process
java.util.concurrent.ExecutionException: org.pitest.util.PitError: null

Please copy and paste the information and the complete stacktrace below when reporting an issue
VM : Java HotSpot(TM) 64-Bit Server VM
Vendor : Oracle Corporation
Version : 25.181-b13
Uptime : 2235935
Input -> 
 1 : -Dfile.encoding=UTF-8
 2 : -Djmri.skipschematests=true
BootClassPathSupported : true

	at java.util.concurrent.FutureTask.report(FutureTask.java:122)
	at java.util.concurrent.FutureTask.get(FutureTask.java:192)
	at org.pitest.util.CommunicationThread.waitToFinish(CommunicationThread.java:60)
	at org.pitest.coverage.execute.CoverageProcess.waitToDie(CoverageProcess.java:35)
	at org.pitest.coverage.execute.DefaultCoverageGenerator.gatherCoverageData(DefaultCoverageGenerator.java:138)
	at org.pitest.coverage.execute.DefaultCoverageGenerator.calculateCoverage(DefaultCoverageGenerator.java:89)
	at org.pitest.coverage.execute.DefaultCoverageGenerator.calculateCoverage(DefaultCoverageGenerator.java:51)
	at org.pitest.mutationtest.tooling.MutationCoverage.runReport(MutationCoverage.java:115)
	at org.pitest.mutationtest.tooling.EntryPoint.execute(EntryPoint.java:120)
	at org.pitest.mutationtest.tooling.EntryPoint.execute(EntryPoint.java:50)
	at org.pitest.maven.RunPitStrategy.execute(RunPitStrategy.java:35)
	at org.pitest.maven.AbstractPitMojo.analyse(AbstractPitMojo.java:466)
	at org.pitest.maven.AbstractPitMojo.execute(AbstractPitMojo.java:407)
	at org.apache.maven.plugin.DefaultBuildPluginManager.executeMojo(DefaultBuildPluginManager.java:137)
	at org.apache.maven.lifecycle.internal.MojoExecutor.execute(MojoExecutor.java:210)
	at org.apache.maven.lifecycle.internal.MojoExecutor.execute(MojoExecutor.java:156)
	at org.apache.maven.lifecycle.internal.MojoExecutor.execute(MojoExecutor.java:148)
	at org.apache.maven.lifecycle.internal.LifecycleModuleBuilder.buildProject(LifecycleModuleBuilder.java:117)
	at org.apache.maven.lifecycle.internal.LifecycleModuleBuilder.buildProject(LifecycleModuleBuilder.java:81)
	at org.apache.maven.lifecycle.internal.builder.singlethreaded.SingleThreadedBuilder.build(SingleThreadedBuilder.java:56)
	at org.apache.maven.lifecycle.internal.LifecycleStarter.execute(LifecycleStarter.java:128)
	at org.apache.maven.DefaultMaven.doExecute(DefaultMaven.java:305)
	at org.apache.maven.DefaultMaven.doExecute(DefaultMaven.java:192)
	at org.apache.maven.DefaultMaven.execute(DefaultMaven.java:105)
	at org.jvnet.hudson.maven3.launcher.Maven35Launcher.main(Maven35Launcher.java:130)
	at sun.reflect.NativeMethodAccessorImpl.invoke0(Native Method)
	at sun.reflect.NativeMethodAccessorImpl.invoke(NativeMethodAccessorImpl.java:62)
	at sun.reflect.DelegatingMethodAccessorImpl.invoke(DelegatingMethodAccessorImpl.java:43)
	at java.lang.reflect.Method.invoke(Method.java:498)
	at org.codehaus.plexus.classworlds.launcher.Launcher.launchEnhanced(Launcher.java:282)
	at org.codehaus.plexus.classworlds.launcher.Launcher.launch(Launcher.java:225)
	at jenkins.maven3.agent.Maven35Main.launch(Maven35Main.java:176)
	at sun.reflect.NativeMethodAccessorImpl.invoke0(Native Method)
	at sun.reflect.NativeMethodAccessorImpl.invoke(NativeMethodAccessorImpl.java:62)
	at sun.reflect.DelegatingMethodAccessorImpl.invoke(DelegatingMethodAccessorImpl.java:43)
	at java.lang.reflect.Method.invoke(Method.java:498)
	at hudson.maven.Maven3Builder.call(Maven3Builder.java:139)
	at hudson.maven.Maven3Builder.call(Maven3Builder.java:70)
	at hudson.remoting.UserRequest.perform(UserRequest.java:212)
	at hudson.remoting.UserRequest.perform(UserRequest.java:54)
	at hudson.remoting.Request$2.run(Request.java:369)
	at hudson.remoting.InterceptingExecutorService$1.call(InterceptingExecutorService.java:72)
	at java.util.concurrent.FutureTask.run(FutureTask.java:266)
	at java.util.concurrent.ThreadPoolExecutor.runWorker(ThreadPoolExecutor.java:1149)
	at java.util.concurrent.ThreadPoolExecutor$Worker.run(ThreadPoolExecutor.java:624)
	at java.lang.Thread.run(Thread.java:748)
Caused by: org.pitest.util.PitError: null

Please copy and paste the information and the complete stacktrace below when reporting an issue
VM : Java HotSpot(TM) 64-Bit Server VM
Vendor : Oracle Corporation
Version : 25.181-b13
Uptime : 2235935
Input -> 
 1 : -Dfile.encoding=UTF-8
 2 : -Djmri.skipschematests=true
BootClassPathSupported : true

	at org.pitest.util.Unchecked.translateCheckedException(Unchecked.java:20)
	at org.pitest.util.SafeDataInputStream.readLong(SafeDataInputStream.java:97)
	at org.pitest.coverage.execute.Receive.readProbeHit(Receive.java:83)
	at org.pitest.coverage.execute.Receive.handleTestEnd(Receive.java:75)
	at org.pitest.coverage.execute.Receive.apply(Receive.java:45)
	at org.pitest.util.SocketReadingCallable.receiveResults(SocketReadingCallable.java:57)
	at org.pitest.util.SocketReadingCallable.call(SocketReadingCallable.java:35)
	at org.pitest.util.SocketReadingCallable.call(SocketReadingCallable.java:12)
	at java.util.concurrent.FutureTask.run(FutureTask.java:266)
	... 1 more
Caused by: java.io.EOFException
	at java.io.DataInputStream.readFully(DataInputStream.java:197)
	at java.io.DataInputStream.readLong(DataInputStream.java:416)
	at org.pitest.util.SafeDataInputStream.readLong(SafeDataInputStream.java:95)
	... 8 more
2:08:39 AM PIT >> SEVERE : Coverage generator Minion exited abnormally due to UNKNOWN_ERROR
[BFA] Scanning build for known causes...
[BFA] No failure causes found
[BFA] Done. 0s
[INFO] ------------------------------------------------------------------------
[INFO] BUILD FAILURE
[INFO] ------------------------------------------------------------------------
[INFO] Total time:  37:08 min
[INFO] Finished at: 2020-01-24T02:08:40Z
[INFO] ------------------------------------------------------------------------
Waiting for Jenkins to finish collecting data
[ERROR] Failed to execute goal org.pitest:pitest-maven:1.4.10:mutationCoverage (default-cli) on project jmri: Execution default-cli of goal org.pitest:pitest-maven:1.4.10:mutationCoverage failed: Coverage generation minion exited abnormally!
[ERROR] 
[ERROR] Please copy and paste the information and the complete stacktrace below when reporting an issue
[ERROR] VM : Java HotSpot(TM) 64-Bit Server VM
[ERROR] Vendor : Oracle Corporation
[ERROR] Version : 25.181-b13
[ERROR] Uptime : 2235938
[ERROR] Input ->
[ERROR] 1 : -Dfile.encoding=UTF-8
[ERROR] 2 : -Djmri.skipschematests=true
[ERROR] BootClassPathSupported : true
[ERROR] 
[ERROR] 
[ERROR] Please copy and paste the information and the complete stacktrace below when reporting an issue
[ERROR] VM : Java HotSpot(TM) 64-Bit Server VM
[ERROR] Vendor : Oracle Corporation
[ERROR] Version : 25.181-b13
[ERROR] Uptime : 2235938
[ERROR] Input ->
[JENKINS] Archiving /var/lib/jenkins/jobs/Development/jobs/PIT/workspace/pom.xml to org.jmri/jmri/4.19.3-SNAPSHOT/jmri-4.19.3-SNAPSHOT.pom
[ERROR] 1 : -Dfile.encoding=UTF-8
[ERROR] 2 : -Djmri.skipschematests=true
[ERROR] BootClassPathSupported : true
[ERROR] -> [Help 1]
[ERROR] 
[ERROR] To see the full stack trace of the errors, re-run Maven with the -e switch.
[ERROR] Re-run Maven using the -X switch to enable full debug logging.
[ERROR] 
[ERROR] For more information about the errors and possible solutions, please read the following articles:
[ERROR] [Help 1] http://cwiki.apache.org/confluence/display/MAVEN/PluginExecutionException
Xvfb stopping
channel stopped
Looking for PIT reports in /var/lib/jenkins/jobs/Development/jobs/PIT/workspace
ERROR: Step ‘Record Pit mutation testing report’ aborted due to exception: 
java.io.IOException: No reports found at location:target/pit-reports/**/mutations.xml 
	at org.jenkinsci.plugins.pitmutation.PitPublisher$ParseReportCallable.invoke(PitPublisher.java:338)
	at org.jenkinsci.plugins.pitmutation.PitPublisher$ParseReportCallable.invoke(PitPublisher.java:320)
	at hudson.FilePath.act(FilePath.java:1078)
	at hudson.FilePath.act(FilePath.java:1061)
	at org.jenkinsci.plugins.pitmutation.PitPublisher.perform(PitPublisher.java:91)
	at hudson.tasks.BuildStepCompatibilityLayer.perform(BuildStepCompatibilityLayer.java:79)
	at hudson.tasks.BuildStepMonitor$3.perform(BuildStepMonitor.java:45)
	at hudson.model.AbstractBuild$AbstractBuildExecution.perform(AbstractBuild.java:741)
	at hudson.model.AbstractBuild$AbstractBuildExecution.performAllBuildSteps(AbstractBuild.java:690)
	at hudson.maven.MavenModuleSetBuild$MavenModuleSetBuildExecution.post2(MavenModuleSetBuild.java:1073)
	at hudson.model.AbstractBuild$AbstractBuildExecution.post(AbstractBuild.java:635)
	at hudson.model.Run.execute(Run.java:1840)
	at hudson.maven.MavenModuleSetBuild.run(MavenModuleSetBuild.java:543)
	at hudson.model.ResourceController.execute(ResourceController.java:97)
	at hudson.model.Executor.run(Executor.java:429)
[BFA] Scanning build for known causes...
[BFA] No failure causes found
[BFA] Done. 0s
Finished: FAILURE