FailedConsole Output

Skipping 2,741 KB.. Full Log
21XNetThrottleTest.testDispatch_ThrottleListener(jmri.jmrix.roco.z21.Z21XNetThrottleTest)
[ERROR]   Run 1: Z21XNetThrottleTest.setUp:276 » IllegalState Timer already cancelled.
[ERROR]   Run 2: Z21XNetThrottleTest.tearDown:282 NullPointer
[INFO] 
[ERROR] jmri.jmrix.roco.z21.Z21XNetThrottleTest.testDispose_ThrottleListener(jmri.jmrix.roco.z21.Z21XNetThrottleTest)
[ERROR]   Run 1: Z21XNetThrottleTest.setUp:276 » IllegalState Timer already cancelled.
[ERROR]   Run 2: Z21XNetThrottleTest.tearDown:282 NullPointer
[INFO] 
[ERROR] jmri.jmrix.roco.z21.Z21XNetThrottleTest.testFinishRecord(jmri.jmrix.roco.z21.Z21XNetThrottleTest)
[ERROR]   Run 1: Z21XNetThrottleTest.setUp:276 » IllegalState Timer already cancelled.
[ERROR]   Run 2: Z21XNetThrottleTest.tearDown:282 NullPointer
[INFO] 
[ERROR] jmri.jmrix.roco.z21.Z21XNetThrottleTest.testGetDccAddress(jmri.jmrix.roco.z21.Z21XNetThrottleTest)
[ERROR]   Run 1: Z21XNetThrottleTest.setUp:276 » IllegalState Timer already cancelled.
[ERROR]   Run 2: Z21XNetThrottleTest.tearDown:282 NullPointer
[INFO] 
[ERROR] jmri.jmrix.roco.z21.Z21XNetThrottleTest.testGetDccAddressHigh(jmri.jmrix.roco.z21.Z21XNetThrottleTest)
[ERROR]   Run 1: Z21XNetThrottleTest.setUp:276 » IllegalState Timer already cancelled.
[ERROR]   Run 2: Z21XNetThrottleTest.tearDown:282 NullPointer
[INFO] 
[ERROR] jmri.jmrix.roco.z21.Z21XNetThrottleTest.testGetDccAddressLow(jmri.jmrix.roco.z21.Z21XNetThrottleTest)
[ERROR]   Run 1: Z21XNetThrottleTest.setUp:276 » IllegalState Timer already cancelled.
[ERROR]   Run 2: Z21XNetThrottleTest.tearDown:282 NullPointer
[INFO] 
[ERROR] jmri.jmrix.roco.z21.Z21XNetThrottleTest.testGetF0(jmri.jmrix.roco.z21.Z21XNetThrottleTest)
[ERROR]   Run 1: Z21XNetThrottleTest.setUp:276 » IllegalState Timer already cancelled.
[ERROR]   Run 2: Z21XNetThrottleTest.tearDown:282 NullPointer
[INFO] 
[ERROR] jmri.jmrix.roco.z21.Z21XNetThrottleTest.testGetF0Momentary(jmri.jmrix.roco.z21.Z21XNetThrottleTest)
[ERROR]   Run 1: Z21XNetThrottleTest.setUp:276 » IllegalState Timer already cancelled.
[ERROR]   Run 2: Z21XNetThrottleTest.tearDown:282 NullPointer
[INFO] 
[ERROR] jmri.jmrix.roco.z21.Z21XNetThrottleTest.testGetF1(jmri.jmrix.roco.z21.Z21XNetThrottleTest)
[ERROR]   Run 1: Z21XNetThrottleTest.setUp:276 » IllegalState Timer already cancelled.
[ERROR]   Run 2: Z21XNetThrottleTest.tearDown:282 NullPointer
[INFO] 
[ERROR] jmri.jmrix.roco.z21.Z21XNetThrottleTest.testGetF10(jmri.jmrix.roco.z21.Z21XNetThrottleTest)
[ERROR]   Run 1: Z21XNetThrottleTest.setUp:276 » IllegalState Timer already cancelled.
[ERROR]   Run 2: Z21XNetThrottleTest.tearDown:282 NullPointer
[INFO] 
[ERROR] jmri.jmrix.roco.z21.Z21XNetThrottleTest.testGetF10Momentary(jmri.jmrix.roco.z21.Z21XNetThrottleTest)
[ERROR]   Run 1: Z21XNetThrottleTest.setUp:276 » IllegalState Timer already cancelled.
[ERROR]   Run 2: Z21XNetThrottleTest.tearDown:282 NullPointer
[INFO] 
[ERROR] jmri.jmrix.roco.z21.Z21XNetThrottleTest.testGetF11(jmri.jmrix.roco.z21.Z21XNetThrottleTest)
[ERROR]   Run 1: Z21XNetThrottleTest.setUp:276 » IllegalState Timer already cancelled.
[ERROR]   Run 2: Z21XNetThrottleTest.tearDown:282 NullPointer
[INFO] 
[ERROR] jmri.jmrix.roco.z21.Z21XNetThrottleTest.testGetF11Momentary(jmri.jmrix.roco.z21.Z21XNetThrottleTest)
[ERROR]   Run 1: Z21XNetThrottleTest.setUp:276 » IllegalState Timer already cancelled.
[ERROR]   Run 2: Z21XNetThrottleTest.tearDown:282 NullPointer
[INFO] 
[ERROR] jmri.jmrix.roco.z21.Z21XNetThrottleTest.testGetF12(jmri.jmrix.roco.z21.Z21XNetThrottleTest)
[ERROR]   Run 1: Z21XNetThrottleTest.setUp:276 » IllegalState Timer already cancelled.
[ERROR]   Run 2: Z21XNetThrottleTest.tearDown:282 NullPointer
[INFO] 
[ERROR] jmri.jmrix.roco.z21.Z21XNetThrottleTest.testGetF12Momentary(jmri.jmrix.roco.z21.Z21XNetThrottleTest)
[ERROR]   Run 1: Z21XNetThrottleTest.setUp:276 » IllegalState Timer already cancelled.
[ERROR]   Run 2: Z21XNetThrottleTest.tearDown:282 NullPointer
[INFO] 
[ERROR] jmri.jmrix.roco.z21.Z21XNetThrottleTest.testGetF13(jmri.jmrix.roco.z21.Z21XNetThrottleTest)
[ERROR]   Run 1: Z21XNetThrottleTest.setUp:276 » IllegalState Timer already cancelled.
[ERROR]   Run 2: Z21XNetThrottleTest.tearDown:282 NullPointer
[INFO] 
[ERROR] jmri.jmrix.roco.z21.Z21XNetThrottleTest.testGetF13Momentary(jmri.jmrix.roco.z21.Z21XNetThrottleTest)
[ERROR]   Run 1: Z21XNetThrottleTest.setUp:276 » IllegalState Timer already cancelled.
[ERROR]   Run 2: Z21XNetThrottleTest.tearDown:282 NullPointer
[INFO] 
[ERROR] jmri.jmrix.roco.z21.Z21XNetThrottleTest.testGetF14(jmri.jmrix.roco.z21.Z21XNetThrottleTest)
[ERROR]   Run 1: Z21XNetThrottleTest.setUp:276 » IllegalState Timer already cancelled.
[ERROR]   Run 2: Z21XNetThrottleTest.tearDown:282 NullPointer
[INFO] 
[ERROR] jmri.jmrix.roco.z21.Z21XNetThrottleTest.testGetF14Momentary(jmri.jmrix.roco.z21.Z21XNetThrottleTest)
[ERROR]   Run 1: Z21XNetThrottleTest.setUp:276 » IllegalState Timer already cancelled.
[ERROR]   Run 2: Z21XNetThrottleTest.tearDown:282 NullPointer
[INFO] 
[ERROR] jmri.jmrix.roco.z21.Z21XNetThrottleTest.testGetF15(jmri.jmrix.roco.z21.Z21XNetThrottleTest)
[ERROR]   Run 1: Z21XNetThrottleTest.setUp:276 » IllegalState Timer already cancelled.
[ERROR]   Run 2: Z21XNetThrottleTest.tearDown:282 NullPointer
[INFO] 
[ERROR] jmri.jmrix.roco.z21.Z21XNetThrottleTest.testGetF15Momentary(jmri.jmrix.roco.z21.Z21XNetThrottleTest)
[ERROR]   Run 1: Z21XNetThrottleTest.setUp:276 » IllegalState Timer already cancelled.
[ERROR]   Run 2: Z21XNetThrottleTest.tearDown:282 NullPointer
[INFO] 
[ERROR] jmri.jmrix.roco.z21.Z21XNetThrottleTest.testGetF16(jmri.jmrix.roco.z21.Z21XNetThrottleTest)
[ERROR]   Run 1: Z21XNetThrottleTest.setUp:276 » IllegalState Timer already cancelled.
[ERROR]   Run 2: Z21XNetThrottleTest.tearDown:282 NullPointer
[INFO] 
[ERROR] jmri.jmrix.roco.z21.Z21XNetThrottleTest.testGetF16Momentary(jmri.jmrix.roco.z21.Z21XNetThrottleTest)
[ERROR]   Run 1: Z21XNetThrottleTest.setUp:276 » IllegalState Timer already cancelled.
[ERROR]   Run 2: Z21XNetThrottleTest.tearDown:282 NullPointer
[INFO] 
[ERROR] jmri.jmrix.roco.z21.Z21XNetThrottleTest.testGetF17(jmri.jmrix.roco.z21.Z21XNetThrottleTest)
[ERROR]   Run 1: Z21XNetThrottleTest.setUp:276 » IllegalState Timer already cancelled.
[ERROR]   Run 2: Z21XNetThrottleTest.tearDown:282 NullPointer
[INFO] 
[ERROR] jmri.jmrix.roco.z21.Z21XNetThrottleTest.testGetF17Momentary(jmri.jmrix.roco.z21.Z21XNetThrottleTest)
[ERROR]   Run 1: Z21XNetThrottleTest.setUp:276 » IllegalState Timer already cancelled.
[ERROR]   Run 2: Z21XNetThrottleTest.tearDown:282 NullPointer
[INFO] 
[ERROR] jmri.jmrix.roco.z21.Z21XNetThrottleTest.testGetF18(jmri.jmrix.roco.z21.Z21XNetThrottleTest)
[ERROR]   Run 1: Z21XNetThrottleTest.setUp:276 » IllegalState Timer already cancelled.
[ERROR]   Run 2: Z21XNetThrottleTest.tearDown:282 NullPointer
[INFO] 
[ERROR] jmri.jmrix.roco.z21.Z21XNetThrottleTest.testGetF18Momentary(jmri.jmrix.roco.z21.Z21XNetThrottleTest)
[ERROR]   Run 1: Z21XNetThrottleTest.setUp:276 » IllegalState Timer already cancelled.
[ERROR]   Run 2: Z21XNetThrottleTest.tearDown:282 NullPointer
[INFO] 
[ERROR] jmri.jmrix.roco.z21.Z21XNetThrottleTest.testGetF19(jmri.jmrix.roco.z21.Z21XNetThrottleTest)
[ERROR]   Run 1: Z21XNetThrottleTest.setUp:276 » IllegalState Timer already cancelled.
[ERROR]   Run 2: Z21XNetThrottleTest.tearDown:282 NullPointer
[INFO] 
[ERROR] jmri.jmrix.roco.z21.Z21XNetThrottleTest.testGetF19Momentary(jmri.jmrix.roco.z21.Z21XNetThrottleTest)
[ERROR]   Run 1: Z21XNetThrottleTest.setUp:276 » IllegalState Timer already cancelled.
[ERROR]   Run 2: Z21XNetThrottleTest.tearDown:282 NullPointer
[INFO] 
[ERROR] jmri.jmrix.roco.z21.Z21XNetThrottleTest.testGetF1Momentary(jmri.jmrix.roco.z21.Z21XNetThrottleTest)
[ERROR]   Run 1: Z21XNetThrottleTest.setUp:276 » IllegalState Timer already cancelled.
[ERROR]   Run 2: Z21XNetThrottleTest.tearDown:282 NullPointer
[INFO] 
[ERROR] jmri.jmrix.roco.z21.Z21XNetThrottleTest.testGetF2(jmri.jmrix.roco.z21.Z21XNetThrottleTest)
[ERROR]   Run 1: Z21XNetThrottleTest.setUp:276 » IllegalState Timer already cancelled.
[ERROR]   Run 2: Z21XNetThrottleTest.tearDown:282 NullPointer
[INFO] 
[ERROR] jmri.jmrix.roco.z21.Z21XNetThrottleTest.testGetF20(jmri.jmrix.roco.z21.Z21XNetThrottleTest)
[ERROR]   Run 1: Z21XNetThrottleTest.setUp:276 » IllegalState Timer already cancelled.
[ERROR]   Run 2: Z21XNetThrottleTest.tearDown:282 NullPointer
[INFO] 
[ERROR] jmri.jmrix.roco.z21.Z21XNetThrottleTest.testGetF20Momentary(jmri.jmrix.roco.z21.Z21XNetThrottleTest)
[ERROR]   Run 1: Z21XNetThrottleTest.setUp:276 » IllegalState Timer already cancelled.
[ERROR]   Run 2: Z21XNetThrottleTest.tearDown:282 NullPointer
[INFO] 
[ERROR] jmri.jmrix.roco.z21.Z21XNetThrottleTest.testGetF21(jmri.jmrix.roco.z21.Z21XNetThrottleTest)
[ERROR]   Run 1: Z21XNetThrottleTest.setUp:276 » IllegalState Timer already cancelled.
[ERROR]   Run 2: Z21XNetThrottleTest.tearDown:282 NullPointer
[INFO] 
[ERROR] jmri.jmrix.roco.z21.Z21XNetThrottleTest.testGetF21Momentary(jmri.jmrix.roco.z21.Z21XNetThrottleTest)
[ERROR]   Run 1: Z21XNetThrottleTest.setUp:276 » IllegalState Timer already cancelled.
[ERROR]   Run 2: Z21XNetThrottleTest.tearDown:282 NullPointer
[INFO] 
[ERROR] jmri.jmrix.roco.z21.Z21XNetThrottleTest.testGetF22(jmri.jmrix.roco.z21.Z21XNetThrottleTest)
[ERROR]   Run 1: Z21XNetThrottleTest.setUp:276 » IllegalState Timer already cancelled.
[ERROR]   Run 2: Z21XNetThrottleTest.tearDown:282 NullPointer
[INFO] 
[ERROR] jmri.jmrix.roco.z21.Z21XNetThrottleTest.testGetF22Momentary(jmri.jmrix.roco.z21.Z21XNetThrottleTest)
[ERROR]   Run 1: Z21XNetThrottleTest.setUp:276 » IllegalState Timer already cancelled.
[ERROR]   Run 2: Z21XNetThrottleTest.tearDown:282 NullPointer
[INFO] 
[ERROR] jmri.jmrix.roco.z21.Z21XNetThrottleTest.testGetF23(jmri.jmrix.roco.z21.Z21XNetThrottleTest)
[ERROR]   Run 1: Z21XNetThrottleTest.setUp:276 » IllegalState Timer already cancelled.
[ERROR]   Run 2: Z21XNetThrottleTest.tearDown:282 NullPointer
[INFO] 
[ERROR] jmri.jmrix.roco.z21.Z21XNetThrottleTest.testGetF23Momentary(jmri.jmrix.roco.z21.Z21XNetThrottleTest)
[ERROR]   Run 1: Z21XNetThrottleTest.setUp:276 » IllegalState Timer already cancelled.
[ERROR]   Run 2: Z21XNetThrottleTest.tearDown:282 NullPointer
[INFO] 
[ERROR] jmri.jmrix.roco.z21.Z21XNetThrottleTest.testGetF24(jmri.jmrix.roco.z21.Z21XNetThrottleTest)
[ERROR]   Run 1: Z21XNetThrottleTest.setUp:276 » IllegalState Timer already cancelled.
[ERROR]   Run 2: Z21XNetThrottleTest.tearDown:282 NullPointer
[INFO] 
[ERROR] jmri.jmrix.roco.z21.Z21XNetThrottleTest.testGetF24Momentary(jmri.jmrix.roco.z21.Z21XNetThrottleTest)
[ERROR]   Run 1: Z21XNetThrottleTest.setUp:276 » IllegalState Timer already cancelled.
[ERROR]   Run 2: Z21XNetThrottleTest.tearDown:282 NullPointer
[INFO] 
[ERROR] jmri.jmrix.roco.z21.Z21XNetThrottleTest.testGetF25(jmri.jmrix.roco.z21.Z21XNetThrottleTest)
[ERROR]   Run 1: Z21XNetThrottleTest.setUp:276 » IllegalState Timer already cancelled.
[ERROR]   Run 2: Z21XNetThrottleTest.tearDown:282 NullPointer
[INFO] 
[ERROR] jmri.jmrix.roco.z21.Z21XNetThrottleTest.testGetF25Momentary(jmri.jmrix.roco.z21.Z21XNetThrottleTest)
[ERROR]   Run 1: Z21XNetThrottleTest.setUp:276 » IllegalState Timer already cancelled.
[ERROR]   Run 2: Z21XNetThrottleTest.tearDown:282 NullPointer
[INFO] 
[ERROR] jmri.jmrix.roco.z21.Z21XNetThrottleTest.testGetF26(jmri.jmrix.roco.z21.Z21XNetThrottleTest)
[ERROR]   Run 1: Z21XNetThrottleTest.setUp:276 » IllegalState Timer already cancelled.
[ERROR]   Run 2: Z21XNetThrottleTest.tearDown:282 NullPointer
[INFO] 
[ERROR] jmri.jmrix.roco.z21.Z21XNetThrottleTest.testGetF26Momentary(jmri.jmrix.roco.z21.Z21XNetThrottleTest)
[ERROR]   Run 1: Z21XNetThrottleTest.setUp:276 » IllegalState Timer already cancelled.
[ERROR]   Run 2: Z21XNetThrottleTest.tearDown:282 NullPointer
[INFO] 
[ERROR] jmri.jmrix.roco.z21.Z21XNetThrottleTest.testGetF27(jmri.jmrix.roco.z21.Z21XNetThrottleTest)
[ERROR]   Run 1: Z21XNetThrottleTest.setUp:276 » IllegalState Timer already cancelled.
[ERROR]   Run 2: Z21XNetThrottleTest.tearDown:282 NullPointer
[INFO] 
[ERROR] jmri.jmrix.roco.z21.Z21XNetThrottleTest.testGetF27Momentary(jmri.jmrix.roco.z21.Z21XNetThrottleTest)
[ERROR]   Run 1: Z21XNetThrottleTest.setUp:276 » IllegalState Timer already cancelled.
[ERROR]   Run 2: Z21XNetThrottleTest.tearDown:282 NullPointer
[INFO] 
[ERROR] jmri.jmrix.roco.z21.Z21XNetThrottleTest.testGetF28(jmri.jmrix.roco.z21.Z21XNetThrottleTest)
[ERROR]   Run 1: Z21XNetThrottleTest.setUp:276 » IllegalState Timer already cancelled.
[ERROR]   Run 2: Z21XNetThrottleTest.tearDown:282 NullPointer
[INFO] 
[ERROR] jmri.jmrix.roco.z21.Z21XNetThrottleTest.testGetF28Momentary(jmri.jmrix.roco.z21.Z21XNetThrottleTest)
[ERROR]   Run 1: Z21XNetThrottleTest.setUp:276 » IllegalState Timer already cancelled.
[ERROR]   Run 2: Z21XNetThrottleTest.tearDown:282 NullPointer
[INFO] 
[ERROR] jmri.jmrix.roco.z21.Z21XNetThrottleTest.testGetF2Momentary(jmri.jmrix.roco.z21.Z21XNetThrottleTest)
[ERROR]   Run 1: Z21XNetThrottleTest.setUp:276 » IllegalState Timer already cancelled.
[ERROR]   Run 2: Z21XNetThrottleTest.tearDown:282 NullPointer
[INFO] 
[ERROR] jmri.jmrix.roco.z21.Z21XNetThrottleTest.testGetF3(jmri.jmrix.roco.z21.Z21XNetThrottleTest)
[ERROR]   Run 1: Z21XNetThrottleTest.setUp:276 » IllegalState Timer already cancelled.
[ERROR]   Run 2: Z21XNetThrottleTest.tearDown:282 NullPointer
[INFO] 
[ERROR] jmri.jmrix.roco.z21.Z21XNetThrottleTest.testGetF3Momentary(jmri.jmrix.roco.z21.Z21XNetThrottleTest)
[ERROR]   Run 1: Z21XNetThrottleTest.setUp:276 » IllegalState Timer already cancelled.
[ERROR]   Run 2: Z21XNetThrottleTest.tearDown:282 NullPointer
[INFO] 
[ERROR] jmri.jmrix.roco.z21.Z21XNetThrottleTest.testGetF4(jmri.jmrix.roco.z21.Z21XNetThrottleTest)
[ERROR]   Run 1: Z21XNetThrottleTest.setUp:276 » IllegalState Timer already cancelled.
[ERROR]   Run 2: Z21XNetThrottleTest.tearDown:282 NullPointer
[INFO] 
[ERROR] jmri.jmrix.roco.z21.Z21XNetThrottleTest.testGetF4Momentary(jmri.jmrix.roco.z21.Z21XNetThrottleTest)
[ERROR]   Run 1: Z21XNetThrottleTest.setUp:276 » IllegalState Timer already cancelled.
[ERROR]   Run 2: Z21XNetThrottleTest.tearDown:282 NullPointer
[INFO] 
[ERROR] jmri.jmrix.roco.z21.Z21XNetThrottleTest.testGetF5(jmri.jmrix.roco.z21.Z21XNetThrottleTest)
[ERROR]   Run 1: Z21XNetThrottleTest.setUp:276 » IllegalState Timer already cancelled.
[ERROR]   Run 2: Z21XNetThrottleTest.tearDown:282 NullPointer
[INFO] 
[ERROR] jmri.jmrix.roco.z21.Z21XNetThrottleTest.testGetF5Momentary(jmri.jmrix.roco.z21.Z21XNetThrottleTest)
[ERROR]   Run 1: Z21XNetThrottleTest.setUp:276 » IllegalState Timer already cancelled.
[ERROR]   Run 2: Z21XNetThrottleTest.tearDown:282 NullPointer
[INFO] 
[ERROR] jmri.jmrix.roco.z21.Z21XNetThrottleTest.testGetF6(jmri.jmrix.roco.z21.Z21XNetThrottleTest)
[ERROR]   Run 1: Z21XNetThrottleTest.setUp:276 » IllegalState Timer already cancelled.
[ERROR]   Run 2: Z21XNetThrottleTest.tearDown:282 NullPointer
[INFO] 
[ERROR] jmri.jmrix.roco.z21.Z21XNetThrottleTest.testGetF6Momentary(jmri.jmrix.roco.z21.Z21XNetThrottleTest)
[ERROR]   Run 1: Z21XNetThrottleTest.setUp:276 » IllegalState Timer already cancelled.
[ERROR]   Run 2: Z21XNetThrottleTest.tearDown:282 NullPointer
[INFO] 
[ERROR] jmri.jmrix.roco.z21.Z21XNetThrottleTest.testGetF7(jmri.jmrix.roco.z21.Z21XNetThrottleTest)
[ERROR]   Run 1: Z21XNetThrottleTest.setUp:276 » IllegalState Timer already cancelled.
[ERROR]   Run 2: Z21XNetThrottleTest.tearDown:282 NullPointer
[INFO] 
[ERROR] jmri.jmrix.roco.z21.Z21XNetThrottleTest.testGetF7Momentary(jmri.jmrix.roco.z21.Z21XNetThrottleTest)
[ERROR]   Run 1: Z21XNetThrottleTest.setUp:276 » IllegalState Timer already cancelled.
[ERROR]   Run 2: Z21XNetThrottleTest.tearDown:282 NullPointer
[INFO] 
[ERROR] jmri.jmrix.roco.z21.Z21XNetThrottleTest.testGetF8(jmri.jmrix.roco.z21.Z21XNetThrottleTest)
[ERROR]   Run 1: Z21XNetThrottleTest.setUp:276 » IllegalState Timer already cancelled.
[ERROR]   Run 2: Z21XNetThrottleTest.tearDown:282 NullPointer
[INFO] 
[ERROR] jmri.jmrix.roco.z21.Z21XNetThrottleTest.testGetF8Momentary(jmri.jmrix.roco.z21.Z21XNetThrottleTest)
[ERROR]   Run 1: Z21XNetThrottleTest.setUp:276 » IllegalState Timer already cancelled.
[ERROR]   Run 2: Z21XNetThrottleTest.tearDown:282 NullPointer
[INFO] 
[ERROR] jmri.jmrix.roco.z21.Z21XNetThrottleTest.testGetF9(jmri.jmrix.roco.z21.Z21XNetThrottleTest)
[ERROR]   Run 1: Z21XNetThrottleTest.setUp:276 » IllegalState Timer already cancelled.
[ERROR]   Run 2: Z21XNetThrottleTest.tearDown:282 NullPointer
[INFO] 
[ERROR] jmri.jmrix.roco.z21.Z21XNetThrottleTest.testGetF9Momentary(jmri.jmrix.roco.z21.Z21XNetThrottleTest)
[ERROR]   Run 1: Z21XNetThrottleTest.setUp:276 » IllegalState Timer already cancelled.
[ERROR]   Run 2: Z21XNetThrottleTest.tearDown:282 NullPointer
[INFO] 
[ERROR] jmri.jmrix.roco.z21.Z21XNetThrottleTest.testGetIsForward(jmri.jmrix.roco.z21.Z21XNetThrottleTest)
[ERROR]   Run 1: Z21XNetThrottleTest.setUp:276 » IllegalState Timer already cancelled.
[ERROR]   Run 2: Z21XNetThrottleTest.tearDown:282 NullPointer
[INFO] 
[ERROR] jmri.jmrix.roco.z21.Z21XNetThrottleTest.testGetListeners(jmri.jmrix.roco.z21.Z21XNetThrottleTest)
[ERROR]   Run 1: Z21XNetThrottleTest.setUp:276 » IllegalState Timer already cancelled.
[ERROR]   Run 2: Z21XNetThrottleTest.tearDown:282 NullPointer
[INFO] 
[ERROR] jmri.jmrix.roco.z21.Z21XNetThrottleTest.testGetLocoAddress(jmri.jmrix.roco.z21.Z21XNetThrottleTest)
[ERROR]   Run 1: Z21XNetThrottleTest.setUp:276 » IllegalState Timer already cancelled.
[ERROR]   Run 2: Z21XNetThrottleTest.tearDown:282 NullPointer
[INFO] 
[ERROR] jmri.jmrix.roco.z21.Z21XNetThrottleTest.testGetRosterEntry(jmri.jmrix.roco.z21.Z21XNetThrottleTest)
[ERROR]   Run 1: Z21XNetThrottleTest.setUp:276 » IllegalState Timer already cancelled.
[ERROR]   Run 2: Z21XNetThrottleTest.tearDown:282 NullPointer
[INFO] 
[ERROR] jmri.jmrix.roco.z21.Z21XNetThrottleTest.testGetSpeedIncrement(jmri.jmrix.roco.z21.Z21XNetThrottleTest)
[ERROR]   Run 1: Z21XNetThrottleTest.setUp:276 » IllegalState Timer already cancelled.
[ERROR]   Run 2: Z21XNetThrottleTest.tearDown:282 NullPointer
[INFO] 
[ERROR] jmri.jmrix.roco.z21.Z21XNetThrottleTest.testGetSpeedSetting(jmri.jmrix.roco.z21.Z21XNetThrottleTest)
[ERROR]   Run 1: Z21XNetThrottleTest.setUp:276 » IllegalState Timer already cancelled.
[ERROR]   Run 2: Z21XNetThrottleTest.tearDown:282 NullPointer
[INFO] 
[ERROR] jmri.jmrix.roco.z21.Z21XNetThrottleTest.testGetSpeedStepMode(jmri.jmrix.roco.z21.Z21XNetThrottleTest)
[ERROR]   Run 1: Z21XNetThrottleTest.setUp:276 » IllegalState Timer already cancelled.
[ERROR]   Run 2: Z21XNetThrottleTest.tearDown:282 NullPointer
[INFO] 
[ERROR] jmri.jmrix.roco.z21.Z21XNetThrottleTest.testGetSpeed_float(jmri.jmrix.roco.z21.Z21XNetThrottleTest)
[ERROR]   Run 1: Z21XNetThrottleTest.setUp:276 » IllegalState Timer already cancelled.
[ERROR]   Run 2: Z21XNetThrottleTest.tearDown:282 NullPointer
[INFO] 
[ERROR] jmri.jmrix.roco.z21.Z21XNetThrottleTest.testGetSpeed_float_int(jmri.jmrix.roco.z21.Z21XNetThrottleTest)
[ERROR]   Run 1: Z21XNetThrottleTest.setUp:276 » IllegalState Timer already cancelled.
[ERROR]   Run 2: Z21XNetThrottleTest.tearDown:282 NullPointer
[INFO] 
[ERROR] jmri.jmrix.roco.z21.Z21XNetThrottleTest.testNotifyPropertyChangeListener(jmri.jmrix.roco.z21.Z21XNetThrottleTest)
[ERROR]   Run 1: Z21XNetThrottleTest.setUp:276 » IllegalState Timer already cancelled.
[ERROR]   Run 2: Z21XNetThrottleTest.tearDown:282 NullPointer
[INFO] 
[ERROR] jmri.jmrix.roco.z21.Z21XNetThrottleTest.testRecord(jmri.jmrix.roco.z21.Z21XNetThrottleTest)
[ERROR]   Run 1: Z21XNetThrottleTest.setUp:276 » IllegalState Timer already cancelled.
[ERROR]   Run 2: Z21XNetThrottleTest.tearDown:282 NullPointer
[INFO] 
[ERROR] jmri.jmrix.roco.z21.Z21XNetThrottleTest.testRelease_ThrottleListener(jmri.jmrix.roco.z21.Z21XNetThrottleTest)
[ERROR]   Run 1: Z21XNetThrottleTest.setUp:276 » IllegalState Timer already cancelled.
[ERROR]   Run 2: Z21XNetThrottleTest.tearDown:282 NullPointer
[INFO] 
[ERROR] jmri.jmrix.roco.z21.Z21XNetThrottleTest.testRemovePropertyChangeListener(jmri.jmrix.roco.z21.Z21XNetThrottleTest)
[ERROR]   Run 1: Z21XNetThrottleTest.setUp:276 » IllegalState Timer already cancelled.
[ERROR]   Run 2: Z21XNetThrottleTest.tearDown:282 NullPointer
[INFO] 
[ERROR] jmri.jmrix.roco.z21.Z21XNetThrottleTest.testSendFunctionGroup1(jmri.jmrix.roco.z21.Z21XNetThrottleTest)
[ERROR]   Run 1: Z21XNetThrottleTest.setUp:276 » IllegalState Timer already cancelled.
[ERROR]   Run 2: Z21XNetThrottleTest.tearDown:282 NullPointer
[INFO] 
[ERROR] jmri.jmrix.roco.z21.Z21XNetThrottleTest.testSendFunctionGroup2(jmri.jmrix.roco.z21.Z21XNetThrottleTest)
[ERROR]   Run 1: Z21XNetThrottleTest.setUp:276 » IllegalState Timer already cancelled.
[ERROR]   Run 2: Z21XNetThrottleTest.tearDown:282 NullPointer
[INFO] 
[ERROR] jmri.jmrix.roco.z21.Z21XNetThrottleTest.testSendFunctionGroup3(jmri.jmrix.roco.z21.Z21XNetThrottleTest)
[ERROR]   Run 1: Z21XNetThrottleTest.setUp:276 » IllegalState Timer already cancelled.
[ERROR]   Run 2: Z21XNetThrottleTest.tearDown:282 NullPointer
[INFO] 
[ERROR] jmri.jmrix.roco.z21.Z21XNetThrottleTest.testSendFunctionGroup4(jmri.jmrix.roco.z21.Z21XNetThrottleTest)
[ERROR]   Run 1: Z21XNetThrottleTest.setUp:276 » IllegalState Timer already cancelled.
[ERROR]   Run 2: Z21XNetThrottleTest.tearDown:282 NullPointer
[INFO] 
[ERROR] jmri.jmrix.roco.z21.Z21XNetThrottleTest.testSendFunctionGroup4v35(jmri.jmrix.roco.z21.Z21XNetThrottleTest)
[ERROR]   Run 1: Z21XNetThrottleTest.setUp:276 » IllegalState Timer already cancelled.
[ERROR]   Run 2: Z21XNetThrottleTest.tearDown:282 NullPointer
[INFO] 
[ERROR] jmri.jmrix.roco.z21.Z21XNetThrottleTest.testSendFunctionGroup5(jmri.jmrix.roco.z21.Z21XNetThrottleTest)
[ERROR]   Run 1: Z21XNetThrottleTest.setUp:276 » IllegalState Timer already cancelled.
[ERROR]   Run 2: Z21XNetThrottleTest.tearDown:282 NullPointer
[INFO] 
[ERROR] jmri.jmrix.roco.z21.Z21XNetThrottleTest.testSendFunctionGroup5v35(jmri.jmrix.roco.z21.Z21XNetThrottleTest)
[ERROR]   Run 1: Z21XNetThrottleTest.setUp:276 » IllegalState Timer already cancelled.
[ERROR]   Run 2: Z21XNetThrottleTest.tearDown:282 NullPointer
[INFO] 
[ERROR] jmri.jmrix.roco.z21.Z21XNetThrottleTest.testSendFunctionHighMomentaryStatusRequest(jmri.jmrix.roco.z21.Z21XNetThrottleTest)
[ERROR]   Run 1: Z21XNetThrottleTest.setUp:276 » IllegalState Timer already cancelled.
[ERROR]   Run 2: Z21XNetThrottleTest.tearDown:282 NullPointer
[INFO] 
[ERROR] jmri.jmrix.roco.z21.Z21XNetThrottleTest.testSendFunctionHighStatusInformationRequest(jmri.jmrix.roco.z21.Z21XNetThrottleTest)
[ERROR]   Run 1: Z21XNetThrottleTest.setUp:276 » IllegalState Timer already cancelled.
[ERROR]   Run 2: Z21XNetThrottleTest.tearDown:282 NullPointer
[INFO] 
[ERROR] jmri.jmrix.roco.z21.Z21XNetThrottleTest.testSendFunctionStatusInformationRequest(jmri.jmrix.roco.z21.Z21XNetThrottleTest)
[ERROR]   Run 1: Z21XNetThrottleTest.setUp:276 » IllegalState Timer already cancelled.
[ERROR]   Run 2: Z21XNetThrottleTest.tearDown:282 NullPointer
[INFO] 
[ERROR] jmri.jmrix.roco.z21.Z21XNetThrottleTest.testSendMomentaryFunctionGroup1(jmri.jmrix.roco.z21.Z21XNetThrottleTest)
[ERROR]   Run 1: Z21XNetThrottleTest.setUp:276 » IllegalState Timer already cancelled.
[ERROR]   Run 2: Z21XNetThrottleTest.tearDown:282 NullPointer
[INFO] 
[ERROR] jmri.jmrix.roco.z21.Z21XNetThrottleTest.testSendMomentaryFunctionGroup2(jmri.jmrix.roco.z21.Z21XNetThrottleTest)
[ERROR]   Run 1: Z21XNetThrottleTest.setUp:276 » IllegalState Timer already cancelled.
[ERROR]   Run 2: Z21XNetThrottleTest.tearDown:282 NullPointer
[INFO] 
[ERROR] jmri.jmrix.roco.z21.Z21XNetThrottleTest.testSendMomentaryFunctionGroup3(jmri.jmrix.roco.z21.Z21XNetThrottleTest)
[ERROR]   Run 1: Z21XNetThrottleTest.setUp:276 » IllegalState Timer already cancelled.
[ERROR]   Run 2: Z21XNetThrottleTest.tearDown:282 NullPointer
[INFO] 
[ERROR] jmri.jmrix.roco.z21.Z21XNetThrottleTest.testSendMomentaryFunctionGroup4(jmri.jmrix.roco.z21.Z21XNetThrottleTest)
[ERROR]   Run 1: Z21XNetThrottleTest.setUp:276 » IllegalState Timer already cancelled.
[ERROR]   Run 2: Z21XNetThrottleTest.tearDown:282 NullPointer
[INFO] 
[ERROR] jmri.jmrix.roco.z21.Z21XNetThrottleTest.testSendMomentaryFunctionGroup5(jmri.jmrix.roco.z21.Z21XNetThrottleTest)
[ERROR]   Run 1: Z21XNetThrottleTest.setUp:276 » IllegalState Timer already cancelled.
[ERROR]   Run 2: Z21XNetThrottleTest.tearDown:282 NullPointer
[INFO] 
[ERROR] jmri.jmrix.roco.z21.Z21XNetThrottleTest.testSendStatusInformationRequest(jmri.jmrix.roco.z21.Z21XNetThrottleTest)
[ERROR]   Run 1: Z21XNetThrottleTest.setUp:276 » IllegalState Timer already cancelled.
[ERROR]   Run 2: Z21XNetThrottleTest.tearDown:282 NullPointer
[INFO] 
[ERROR] jmri.jmrix.roco.z21.Z21XNetThrottleTest.testSetF0(jmri.jmrix.roco.z21.Z21XNetThrottleTest)
[ERROR]   Run 1: Z21XNetThrottleTest.setUp:276 » IllegalState Timer already cancelled.
[ERROR]   Run 2: Z21XNetThrottleTest.tearDown:282 NullPointer
[INFO] 
[ERROR] jmri.jmrix.roco.z21.Z21XNetThrottleTest.testSetF0Momentary(jmri.jmrix.roco.z21.Z21XNetThrottleTest)
[ERROR]   Run 1: Z21XNetThrottleTest.setUp:276 » IllegalState Timer already cancelled.
[ERROR]   Run 2: Z21XNetThrottleTest.tearDown:282 NullPointer
[INFO] 
[ERROR] jmri.jmrix.roco.z21.Z21XNetThrottleTest.testSetF1(jmri.jmrix.roco.z21.Z21XNetThrottleTest)
[ERROR]   Run 1: Z21XNetThrottleTest.setUp:276 » IllegalState Timer already cancelled.
[ERROR]   Run 2: Z21XNetThrottleTest.tearDown:282 NullPointer
[INFO] 
[ERROR] jmri.jmrix.roco.z21.Z21XNetThrottleTest.testSetF10(jmri.jmrix.roco.z21.Z21XNetThrottleTest)
[ERROR]   Run 1: Z21XNetThrottleTest.setUp:276 » IllegalState Timer already cancelled.
[ERROR]   Run 2: Z21XNetThrottleTest.tearDown:282 NullPointer
[INFO] 
[ERROR] jmri.jmrix.roco.z21.Z21XNetThrottleTest.testSetF10Momentary(jmri.jmrix.roco.z21.Z21XNetThrottleTest)
[ERROR]   Run 1: Z21XNetThrottleTest.setUp:276 » IllegalState Timer already cancelled.
[ERROR]   Run 2: Z21XNetThrottleTest.tearDown:282 NullPointer
[INFO] 
[ERROR] jmri.jmrix.roco.z21.Z21XNetThrottleTest.testSetF11(jmri.jmrix.roco.z21.Z21XNetThrottleTest)
[ERROR]   Run 1: Z21XNetThrottleTest.setUp:276 » IllegalState Timer already cancelled.
[ERROR]   Run 2: Z21XNetThrottleTest.tearDown:282 NullPointer
[INFO] 
[ERROR] jmri.jmrix.roco.z21.Z21XNetThrottleTest.testSetF11Momentary(jmri.jmrix.roco.z21.Z21XNetThrottleTest)
[ERROR]   Run 1: Z21XNetThrottleTest.setUp:276 » IllegalState Timer already cancelled.
[ERROR]   Run 2: Z21XNetThrottleTest.tearDown:282 NullPointer
[INFO] 
[ERROR] jmri.jmrix.roco.z21.Z21XNetThrottleTest.testSetF12(jmri.jmrix.roco.z21.Z21XNetThrottleTest)
[ERROR]   Run 1: Z21XNetThrottleTest.setUp:276 » IllegalState Timer already cancelled.
[ERROR]   Run 2: Z21XNetThrottleTest.tearDown:282 NullPointer
[INFO] 
[ERROR] jmri.jmrix.roco.z21.Z21XNetThrottleTest.testSetF12Momentary(jmri.jmrix.roco.z21.Z21XNetThrottleTest)
[ERROR]   Run 1: Z21XNetThrottleTest.setUp:276 » IllegalState Timer already cancelled.
[ERROR]   Run 2: Z21XNetThrottleTest.tearDown:282 NullPointer
[INFO] 
[ERROR] jmri.jmrix.roco.z21.Z21XNetThrottleTest.testSetF13(jmri.jmrix.roco.z21.Z21XNetThrottleTest)
[ERROR]   Run 1: Z21XNetThrottleTest.setUp:276 » IllegalState Timer already cancelled.
[ERROR]   Run 2: Z21XNetThrottleTest.tearDown:282 NullPointer
[INFO] 
[ERROR] jmri.jmrix.roco.z21.Z21XNetThrottleTest.testSetF13Momentary(jmri.jmrix.roco.z21.Z21XNetThrottleTest)
[ERROR]   Run 1: Z21XNetThrottleTest.setUp:276 » IllegalState Timer already cancelled.
[ERROR]   Run 2: Z21XNetThrottleTest.tearDown:282 NullPointer
[INFO] 
[ERROR] jmri.jmrix.roco.z21.Z21XNetThrottleTest.testSetF14(jmri.jmrix.roco.z21.Z21XNetThrottleTest)
[ERROR]   Run 1: Z21XNetThrottleTest.setUp:276 » IllegalState Timer already cancelled.
[ERROR]   Run 2: Z21XNetThrottleTest.tearDown:282 NullPointer
[INFO] 
[ERROR] jmri.jmrix.roco.z21.Z21XNetThrottleTest.testSetF14Momentary(jmri.jmrix.roco.z21.Z21XNetThrottleTest)
[ERROR]   Run 1: Z21XNetThrottleTest.setUp:276 » IllegalState Timer already cancelled.
[ERROR]   Run 2: Z21XNetThrottleTest.tearDown:282 NullPointer
[INFO] 
[ERROR] jmri.jmrix.roco.z21.Z21XNetThrottleTest.testSetF15(jmri.jmrix.roco.z21.Z21XNetThrottleTest)
[ERROR]   Run 1: Z21XNetThrottleTest.setUp:276 » IllegalState Timer already cancelled.
[ERROR]   Run 2: Z21XNetThrottleTest.tearDown:282 NullPointer
[INFO] 
[ERROR] jmri.jmrix.roco.z21.Z21XNetThrottleTest.testSetF15Momentary(jmri.jmrix.roco.z21.Z21XNetThrottleTest)
[ERROR]   Run 1: Z21XNetThrottleTest.setUp:276 » IllegalState Timer already cancelled.
[ERROR]   Run 2: Z21XNetThrottleTest.tearDown:282 NullPointer
[INFO] 
[ERROR] jmri.jmrix.roco.z21.Z21XNetThrottleTest.testSetF16(jmri.jmrix.roco.z21.Z21XNetThrottleTest)
[ERROR]   Run 1: Z21XNetThrottleTest.setUp:276 » IllegalState Timer already cancelled.
[ERROR]   Run 2: Z21XNetThrottleTest.tearDown:282 NullPointer
[INFO] 
[ERROR] jmri.jmrix.roco.z21.Z21XNetThrottleTest.testSetF16Momentary(jmri.jmrix.roco.z21.Z21XNetThrottleTest)
[ERROR]   Run 1: Z21XNetThrottleTest.setUp:276 » IllegalState Timer already cancelled.
[ERROR]   Run 2: Z21XNetThrottleTest.tearDown:282 NullPointer
[INFO] 
[ERROR] jmri.jmrix.roco.z21.Z21XNetThrottleTest.testSetF17(jmri.jmrix.roco.z21.Z21XNetThrottleTest)
[ERROR]   Run 1: Z21XNetThrottleTest.setUp:276 » IllegalState Timer already cancelled.
[ERROR]   Run 2: Z21XNetThrottleTest.tearDown:282 NullPointer
[INFO] 
[ERROR] jmri.jmrix.roco.z21.Z21XNetThrottleTest.testSetF17Momentary(jmri.jmrix.roco.z21.Z21XNetThrottleTest)
[ERROR]   Run 1: Z21XNetThrottleTest.setUp:276 » IllegalState Timer already cancelled.
[ERROR]   Run 2: Z21XNetThrottleTest.tearDown:282 NullPointer
[INFO] 
[ERROR] jmri.jmrix.roco.z21.Z21XNetThrottleTest.testSetF18(jmri.jmrix.roco.z21.Z21XNetThrottleTest)
[ERROR]   Run 1: Z21XNetThrottleTest.setUp:276 » IllegalState Timer already cancelled.
[ERROR]   Run 2: Z21XNetThrottleTest.tearDown:282 NullPointer
[INFO] 
[ERROR] jmri.jmrix.roco.z21.Z21XNetThrottleTest.testSetF18Momentary(jmri.jmrix.roco.z21.Z21XNetThrottleTest)
[ERROR]   Run 1: Z21XNetThrottleTest.setUp:276 » IllegalState Timer already cancelled.
[ERROR]   Run 2: Z21XNetThrottleTest.tearDown:282 NullPointer
[INFO] 
[ERROR] jmri.jmrix.roco.z21.Z21XNetThrottleTest.testSetF19(jmri.jmrix.roco.z21.Z21XNetThrottleTest)
[ERROR]   Run 1: Z21XNetThrottleTest.setUp:276 » IllegalState Timer already cancelled.
[ERROR]   Run 2: Z21XNetThrottleTest.tearDown:282 NullPointer
[INFO] 
[ERROR] jmri.jmrix.roco.z21.Z21XNetThrottleTest.testSetF19Momentary(jmri.jmrix.roco.z21.Z21XNetThrottleTest)
[ERROR]   Run 1: Z21XNetThrottleTest.setUp:276 » IllegalState Timer already cancelled.
[ERROR]   Run 2: Z21XNetThrottleTest.tearDown:282 NullPointer
[INFO] 
[ERROR] jmri.jmrix.roco.z21.Z21XNetThrottleTest.testSetF1Momentary(jmri.jmrix.roco.z21.Z21XNetThrottleTest)
[ERROR]   Run 1: Z21XNetThrottleTest.setUp:276 » IllegalState Timer already cancelled.
[ERROR]   Run 2: Z21XNetThrottleTest.tearDown:282 NullPointer
[INFO] 
[ERROR] jmri.jmrix.roco.z21.Z21XNetThrottleTest.testSetF2(jmri.jmrix.roco.z21.Z21XNetThrottleTest)
[ERROR]   Run 1: Z21XNetThrottleTest.setUp:276 » IllegalState Timer already cancelled.
[ERROR]   Run 2: Z21XNetThrottleTest.tearDown:282 NullPointer
[INFO] 
[ERROR] jmri.jmrix.roco.z21.Z21XNetThrottleTest.testSetF20(jmri.jmrix.roco.z21.Z21XNetThrottleTest)
[ERROR]   Run 1: Z21XNetThrottleTest.setUp:276 » IllegalState Timer already cancelled.
[ERROR]   Run 2: Z21XNetThrottleTest.tearDown:282 NullPointer
[INFO] 
[ERROR] jmri.jmrix.roco.z21.Z21XNetThrottleTest.testSetF20Momentary(jmri.jmrix.roco.z21.Z21XNetThrottleTest)
[ERROR]   Run 1: Z21XNetThrottleTest.setUp:276 » IllegalState Timer already cancelled.
[ERROR]   Run 2: Z21XNetThrottleTest.tearDown:282 NullPointer
[INFO] 
[ERROR] jmri.jmrix.roco.z21.Z21XNetThrottleTest.testSetF21(jmri.jmrix.roco.z21.Z21XNetThrottleTest)
[ERROR]   Run 1: Z21XNetThrottleTest.setUp:276 » IllegalState Timer already cancelled.
[ERROR]   Run 2: Z21XNetThrottleTest.tearDown:282 NullPointer
[INFO] 
[ERROR] jmri.jmrix.roco.z21.Z21XNetThrottleTest.testSetF21Momentary(jmri.jmrix.roco.z21.Z21XNetThrottleTest)
[ERROR]   Run 1: Z21XNetThrottleTest.setUp:276 » IllegalState Timer already cancelled.
[ERROR]   Run 2: Z21XNetThrottleTest.tearDown:282 NullPointer
[INFO] 
[ERROR] jmri.jmrix.roco.z21.Z21XNetThrottleTest.testSetF22(jmri.jmrix.roco.z21.Z21XNetThrottleTest)
[ERROR]   Run 1: Z21XNetThrottleTest.setUp:276 » IllegalState Timer already cancelled.
[ERROR]   Run 2: Z21XNetThrottleTest.tearDown:282 NullPointer
[INFO] 
[ERROR] jmri.jmrix.roco.z21.Z21XNetThrottleTest.testSetF22Momentary(jmri.jmrix.roco.z21.Z21XNetThrottleTest)
[ERROR]   Run 1: Z21XNetThrottleTest.setUp:276 » IllegalState Timer already cancelled.
[ERROR]   Run 2: Z21XNetThrottleTest.tearDown:282 NullPointer
[INFO] 
[ERROR] jmri.jmrix.roco.z21.Z21XNetThrottleTest.testSetF23(jmri.jmrix.roco.z21.Z21XNetThrottleTest)
[ERROR]   Run 1: Z21XNetThrottleTest.setUp:276 » IllegalState Timer already cancelled.
[ERROR]   Run 2: Z21XNetThrottleTest.tearDown:282 NullPointer
[INFO] 
[ERROR] jmri.jmrix.roco.z21.Z21XNetThrottleTest.testSetF23Momentary(jmri.jmrix.roco.z21.Z21XNetThrottleTest)
[ERROR]   Run 1: Z21XNetThrottleTest.setUp:276 » IllegalState Timer already cancelled.
[ERROR]   Run 2: Z21XNetThrottleTest.tearDown:282 NullPointer
[INFO] 
[ERROR] jmri.jmrix.roco.z21.Z21XNetThrottleTest.testSetF24(jmri.jmrix.roco.z21.Z21XNetThrottleTest)
[ERROR]   Run 1: Z21XNetThrottleTest.setUp:276 » IllegalState Timer already cancelled.
[ERROR]   Run 2: Z21XNetThrottleTest.tearDown:282 NullPointer
[INFO] 
[ERROR] jmri.jmrix.roco.z21.Z21XNetThrottleTest.testSetF24Momentary(jmri.jmrix.roco.z21.Z21XNetThrottleTest)
[ERROR]   Run 1: Z21XNetThrottleTest.setUp:276 » IllegalState Timer already cancelled.
[ERROR]   Run 2: Z21XNetThrottleTest.tearDown:282 NullPointer
[INFO] 
[ERROR] jmri.jmrix.roco.z21.Z21XNetThrottleTest.testSetF25(jmri.jmrix.roco.z21.Z21XNetThrottleTest)
[ERROR]   Run 1: Z21XNetThrottleTest.setUp:276 » IllegalState Timer already cancelled.
[ERROR]   Run 2: Z21XNetThrottleTest.tearDown:282 NullPointer
[INFO] 
[ERROR] jmri.jmrix.roco.z21.Z21XNetThrottleTest.testSetF25Momentary(jmri.jmrix.roco.z21.Z21XNetThrottleTest)
[ERROR]   Run 1: Z21XNetThrottleTest.setUp:276 » IllegalState Timer already cancelled.
[ERROR]   Run 2: Z21XNetThrottleTest.tearDown:282 NullPointer
[INFO] 
[ERROR] jmri.jmrix.roco.z21.Z21XNetThrottleTest.testSetF26(jmri.jmrix.roco.z21.Z21XNetThrottleTest)
[ERROR]   Run 1: Z21XNetThrottleTest.setUp:276 » IllegalState Timer already cancelled.
[ERROR]   Run 2: Z21XNetThrottleTest.tearDown:282 NullPointer
[INFO] 
[ERROR] jmri.jmrix.roco.z21.Z21XNetThrottleTest.testSetF26Momentary(jmri.jmrix.roco.z21.Z21XNetThrottleTest)
[ERROR]   Run 1: Z21XNetThrottleTest.setUp:276 » IllegalState Timer already cancelled.
[ERROR]   Run 2: Z21XNetThrottleTest.tearDown:282 NullPointer
[INFO] 
[ERROR] jmri.jmrix.roco.z21.Z21XNetThrottleTest.testSetF27(jmri.jmrix.roco.z21.Z21XNetThrottleTest)
[ERROR]   Run 1: Z21XNetThrottleTest.setUp:276 » IllegalState Timer already cancelled.
[ERROR]   Run 2: Z21XNetThrottleTest.tearDown:282 NullPointer
[INFO] 
[ERROR] jmri.jmrix.roco.z21.Z21XNetThrottleTest.testSetF27Momentary(jmri.jmrix.roco.z21.Z21XNetThrottleTest)
[ERROR]   Run 1: Z21XNetThrottleTest.setUp:276 » IllegalState Timer already cancelled.
[ERROR]   Run 2: Z21XNetThrottleTest.tearDown:282 NullPointer
[INFO] 
[ERROR] jmri.jmrix.roco.z21.Z21XNetThrottleTest.testSetF28(jmri.jmrix.roco.z21.Z21XNetThrottleTest)
[ERROR]   Run 1: Z21XNetThrottleTest.setUp:276 » IllegalState Timer already cancelled.
[ERROR]   Run 2: Z21XNetThrottleTest.tearDown:282 NullPointer
[INFO] 
[ERROR] jmri.jmrix.roco.z21.Z21XNetThrottleTest.testSetF28Momentary(jmri.jmrix.roco.z21.Z21XNetThrottleTest)
[ERROR]   Run 1: Z21XNetThrottleTest.setUp:276 » IllegalState Timer already cancelled.
[ERROR]   Run 2: Z21XNetThrottleTest.tearDown:282 NullPointer
[INFO] 
[ERROR] jmri.jmrix.roco.z21.Z21XNetThrottleTest.testSetF2Momentary(jmri.jmrix.roco.z21.Z21XNetThrottleTest)
[ERROR]   Run 1: Z21XNetThrottleTest.setUp:276 » IllegalState Timer already cancelled.
[ERROR]   Run 2: Z21XNetThrottleTest.tearDown:282 NullPointer
[INFO] 
[ERROR] jmri.jmrix.roco.z21.Z21XNetThrottleTest.testSetF3(jmri.jmrix.roco.z21.Z21XNetThrottleTest)
[ERROR]   Run 1: Z21XNetThrottleTest.setUp:276 » IllegalState Timer already cancelled.
[ERROR]   Run 2: Z21XNetThrottleTest.tearDown:282 NullPointer
[INFO] 
[ERROR] jmri.jmrix.roco.z21.Z21XNetThrottleTest.testSetF3Momentary(jmri.jmrix.roco.z21.Z21XNetThrottleTest)
[ERROR]   Run 1: Z21XNetThrottleTest.setUp:276 » IllegalState Timer already cancelled.
[ERROR]   Run 2: Z21XNetThrottleTest.tearDown:282 NullPointer
[INFO] 
[ERROR] jmri.jmrix.roco.z21.Z21XNetThrottleTest.testSetF4(jmri.jmrix.roco.z21.Z21XNetThrottleTest)
[ERROR]   Run 1: Z21XNetThrottleTest.setUp:276 » IllegalState Timer already cancelled.
[ERROR]   Run 2: Z21XNetThrottleTest.tearDown:282 NullPointer
[INFO] 
[ERROR] jmri.jmrix.roco.z21.Z21XNetThrottleTest.testSetF4Momentary(jmri.jmrix.roco.z21.Z21XNetThrottleTest)
[ERROR]   Run 1: Z21XNetThrottleTest.setUp:276 » IllegalState Timer already cancelled.
[ERROR]   Run 2: Z21XNetThrottleTest.tearDown:282 NullPointer
[INFO] 
[ERROR] jmri.jmrix.roco.z21.Z21XNetThrottleTest.testSetF5(jmri.jmrix.roco.z21.Z21XNetThrottleTest)
[ERROR]   Run 1: Z21XNetThrottleTest.setUp:276 » IllegalState Timer already cancelled.
[ERROR]   Run 2: Z21XNetThrottleTest.tearDown:282 NullPointer
[INFO] 
[ERROR] jmri.jmrix.roco.z21.Z21XNetThrottleTest.testSetF5Momentary(jmri.jmrix.roco.z21.Z21XNetThrottleTest)
[ERROR]   Run 1: Z21XNetThrottleTest.setUp:276 » IllegalState Timer already cancelled.
[ERROR]   Run 2: Z21XNetThrottleTest.tearDown:282 NullPointer
[INFO] 
[ERROR] jmri.jmrix.roco.z21.Z21XNetThrottleTest.testSetF6(jmri.jmrix.roco.z21.Z21XNetThrottleTest)
[ERROR]   Run 1: Z21XNetThrottleTest.setUp:276 » IllegalState Timer already cancelled.
[ERROR]   Run 2: Z21XNetThrottleTest.tearDown:282 NullPointer
[INFO] 
[ERROR] jmri.jmrix.roco.z21.Z21XNetThrottleTest.testSetF6Momentary(jmri.jmrix.roco.z21.Z21XNetThrottleTest)
[ERROR]   Run 1: Z21XNetThrottleTest.setUp:276 » IllegalState Timer already cancelled.
[ERROR]   Run 2: Z21XNetThrottleTest.tearDown:282 NullPointer
[INFO] 
[ERROR] jmri.jmrix.roco.z21.Z21XNetThrottleTest.testSetF7(jmri.jmrix.roco.z21.Z21XNetThrottleTest)
[ERROR]   Run 1: Z21XNetThrottleTest.setUp:276 » IllegalState Timer already cancelled.
[ERROR]   Run 2: Z21XNetThrottleTest.tearDown:282 NullPointer
[INFO] 
[ERROR] jmri.jmrix.roco.z21.Z21XNetThrottleTest.testSetF7Momentary(jmri.jmrix.roco.z21.Z21XNetThrottleTest)
[ERROR]   Run 1: Z21XNetThrottleTest.setUp:276 » IllegalState Timer already cancelled.
[ERROR]   Run 2: Z21XNetThrottleTest.tearDown:282 NullPointer
[INFO] 
[ERROR] jmri.jmrix.roco.z21.Z21XNetThrottleTest.testSetF8(jmri.jmrix.roco.z21.Z21XNetThrottleTest)
[ERROR]   Run 1: Z21XNetThrottleTest.setUp:276 » IllegalState Timer already cancelled.
[ERROR]   Run 2: Z21XNetThrottleTest.tearDown:282 NullPointer
[INFO] 
[ERROR] jmri.jmrix.roco.z21.Z21XNetThrottleTest.testSetF8Momentary(jmri.jmrix.roco.z21.Z21XNetThrottleTest)
[ERROR]   Run 1: Z21XNetThrottleTest.setUp:276 » IllegalState Timer already cancelled.
[ERROR]   Run 2: Z21XNetThrottleTest.tearDown:282 NullPointer
[INFO] 
[ERROR] jmri.jmrix.roco.z21.Z21XNetThrottleTest.testSetF9(jmri.jmrix.roco.z21.Z21XNetThrottleTest)
[ERROR]   Run 1: Z21XNetThrottleTest.setUp:276 » IllegalState Timer already cancelled.
[ERROR]   Run 2: Z21XNetThrottleTest.tearDown:282 NullPointer
[INFO] 
[ERROR] jmri.jmrix.roco.z21.Z21XNetThrottleTest.testSetF9Momentary(jmri.jmrix.roco.z21.Z21XNetThrottleTest)
[ERROR]   Run 1: Z21XNetThrottleTest.setUp:276 » IllegalState Timer already cancelled.
[ERROR]   Run 2: Z21XNetThrottleTest.tearDown:282 NullPointer
[INFO] 
[ERROR] jmri.jmrix.roco.z21.Z21XNetThrottleTest.testSetIsForward(jmri.jmrix.roco.z21.Z21XNetThrottleTest)
[ERROR]   Run 1: Z21XNetThrottleTest.setUp:276 » IllegalState Timer already cancelled.
[ERROR]   Run 2: Z21XNetThrottleTest.tearDown:282 NullPointer
[INFO] 
[ERROR] jmri.jmrix.roco.z21.Z21XNetThrottleTest.testSetRosterEntry(jmri.jmrix.roco.z21.Z21XNetThrottleTest)
[ERROR]   Run 1: Z21XNetThrottleTest.setUp:276 » IllegalState Timer already cancelled.
[ERROR]   Run 2: Z21XNetThrottleTest.tearDown:282 NullPointer
[INFO] 
[ERROR] jmri.jmrix.roco.z21.Z21XNetThrottleTest.testSetSpeedSetting(jmri.jmrix.roco.z21.Z21XNetThrottleTest)
[ERROR]   Run 1: Z21XNetThrottleTest.setUp:276 » IllegalState Timer already cancelled.
[ERROR]   Run 2: Z21XNetThrottleTest.tearDown:282 NullPointer
[INFO] 
[ERROR] jmri.jmrix.roco.z21.Z21XNetThrottleTest.testSetSpeedSettingAgain(jmri.jmrix.roco.z21.Z21XNetThrottleTest)
[ERROR]   Run 1: Z21XNetThrottleTest.setUp:276 » IllegalState Timer already cancelled.
[ERROR]   Run 2: Z21XNetThrottleTest.tearDown:282 NullPointer
[INFO] 
[ERROR] jmri.jmrix.roco.z21.Z21XNetThrottleTest.testSetSpeedStepMode(jmri.jmrix.roco.z21.Z21XNetThrottleTest)
[ERROR]   Run 1: Z21XNetThrottleTest.setUp:276 » IllegalState Timer already cancelled.
[ERROR]   Run 2: Z21XNetThrottleTest.tearDown:282 NullPointer
[INFO] 
[ERROR] jmri.jmrix.roco.z21.Z21XNetThrottleTest.testStartClock(jmri.jmrix.roco.z21.Z21XNetThrottleTest)
[ERROR]   Run 1: Z21XNetThrottleTest.setUp:276 » IllegalState Timer already cancelled.
[ERROR]   Run 2: Z21XNetThrottleTest.tearDown:282 NullPointer
[INFO] 
[ERROR] jmri.jmrix.roco.z21.Z21XNetThrottleTest.testStopClock(jmri.jmrix.roco.z21.Z21XNetThrottleTest)
[ERROR]   Run 1: Z21XNetThrottleTest.setUp:276 » IllegalState Timer already cancelled.
[ERROR]   Run 2: Z21XNetThrottleTest.tearDown:282 NullPointer
[INFO] 
[ERROR] jmri.jmrix.roco.z21.Z21XNetThrottleTest.testThrottleDispose(jmri.jmrix.roco.z21.Z21XNetThrottleTest)
[ERROR]   Run 1: Z21XNetThrottleTest.setUp:276 » IllegalState Timer already cancelled.
[ERROR]   Run 2: Z21XNetThrottleTest.tearDown:282 NullPointer
[INFO] 
[ERROR]   Z21SimulatorAdapterTest.testAddressedProgrammerManager:152 » IllegalState Time...
[INFO] 
[ERROR] Tests run: 42331, Failures: 3, Errors: 473, Skipped: 826
[INFO] 
[ERROR] There are test failures.

Please refer to /var/lib/jenkins/jobs/Development/jobs/PIT/workspace/target/surefire-reports for the individual test results.
Please refer to dump files (if any exist) [date]-jvmRun[N].dump, [date].dumpstream and [date]-jvmRun[N].dumpstream.
[JENKINS] Recording test results
[WARNING] Attempt to (de-)serialize anonymous class hudson.maven.reporters.SurefireArchiver$2; see: https://jenkins.io/redirect/serialization-of-anonymous-classes/
[INFO] 
[INFO] --- pitest-maven:1.4.10:mutationCoverage (default-cli) @ jmri ---
[INFO] Found plugin : Default csv report plugin
[INFO] Found plugin : Default xml report plugin
[INFO] Found plugin : Default html report plugin
[INFO] Found plugin : Static initializer code detector plugin
[INFO] Found plugin : Static initializer filter plugin
[INFO] Found plugin : Excluded annotations plugin
[INFO] Found plugin : Inlined finally block filter plugin
[INFO] Found plugin : Try with resources filter
[INFO] Found plugin : Implicit null check filter
[INFO] Found plugin : Method reference null check filter
[INFO] Found plugin : For each loop filter
[INFO] Found plugin : Logging calls filter
[INFO] Found plugin : Infinite for loop filter
[INFO] Found plugin : Long running iterator loop filter
[INFO] Found plugin : For loop counter filter
[INFO] Found plugin : Kotlin junk mutations filter
[INFO] Found plugin : Max mutations per class limit
[INFO] Found plugin : Equals shortcut equivalent mutant filter
[INFO] Found plugin : Trivial return vals equivalence filter
[INFO] Found plugin : Mutant export plugin
[INFO] Found shared classpath plugin : Default mutation engine
[INFO] Found shared classpath plugin : JUnit plugin
[INFO] Found shared classpath plugin : TestNG plugin
[INFO] Adding org.pitest:pitest to SUT classpath
[INFO] Mutating from /var/lib/jenkins/jobs/Development/jobs/PIT/workspace/target/classes
[INFO] Defaulting target classes to match packages in build directory
1:23:32 AM PIT >> INFO : Verbose logging is disabled. If you encounter a problem, please enable it before reporting an issue.
1:23:39 AM PIT >> INFO : MINION : Picked up JAVA_TOOL_OPTIONS: -Dfile.encoding=UTF-8

1:23:39 AM PIT >> INFO : Sending 12360 test classes to minion
1:23:39 AM PIT >> INFO : Sent tests to minion
1:23:39 AM PIT >> INFO : MINION : 1:23:39 AM PIT >> INFO : Checking environment

1:23:49 AM PIT >> INFO : MINION : 1:23:49 AM PIT >> WARNING : Could not load jmri.script.import.imported$py (NoClassDefFoundError: jmri/script/import/imported$py (wrong name: imported$py))

1:24:57 AM PIT >> INFO : MINION : 1:24:57 AM PIT >> INFO : Found  41785 tests

1:24:57 AM PIT >> INFO : MINION : 1:24:57 AM PIT >> INFO : Dependency analysis reduced number of potential tests by 0

1:24:57 AM PIT >> INFO : MINION : 1:24:57 AM PIT >> INFO : 41785 tests received

/1:24:57 AM PIT >> INFO : MINION : 1:24:57 AM PIT >> WARNING : More threads at end of test (8) testCTor(apps.AppsLaunchFrameTest) than start. (6)

-\|/-\|/-\|/-\|/-\1:24:58 AM PIT >> INFO : MINION : 1:24:58 AM PIT >> WARNING : More threads at end of test (10) testCTor(apps.FileLocationPaneTest) than start. (8)

|/-\|/-\|1:24:58 AM PIT >> WARNING : Error while watching child process
java.util.concurrent.ExecutionException: org.pitest.util.PitError: null

Please copy and paste the information and the complete stacktrace below when reporting an issue
VM : Java HotSpot(TM) 64-Bit Server VM
Vendor : Oracle Corporation
Version : 25.181-b13
Uptime : 2236590
Input -> 
 1 : -Dfile.encoding=UTF-8
 2 : -Djmri.skipschematests=true
BootClassPathSupported : true

	at java.util.concurrent.FutureTask.report(FutureTask.java:122)
	at java.util.concurrent.FutureTask.get(FutureTask.java:192)
	at org.pitest.util.CommunicationThread.waitToFinish(CommunicationThread.java:60)
	at org.pitest.coverage.execute.CoverageProcess.waitToDie(CoverageProcess.java:35)
	at org.pitest.coverage.execute.DefaultCoverageGenerator.gatherCoverageData(DefaultCoverageGenerator.java:138)
	at org.pitest.coverage.execute.DefaultCoverageGenerator.calculateCoverage(DefaultCoverageGenerator.java:89)
	at org.pitest.coverage.execute.DefaultCoverageGenerator.calculateCoverage(DefaultCoverageGenerator.java:51)
	at org.pitest.mutationtest.tooling.MutationCoverage.runReport(MutationCoverage.java:115)
	at org.pitest.mutationtest.tooling.EntryPoint.execute(EntryPoint.java:120)
	at org.pitest.mutationtest.tooling.EntryPoint.execute(EntryPoint.java:50)
	at org.pitest.maven.RunPitStrategy.execute(RunPitStrategy.java:35)
	at org.pitest.maven.AbstractPitMojo.analyse(AbstractPitMojo.java:466)
	at org.pitest.maven.AbstractPitMojo.execute(AbstractPitMojo.java:407)
	at org.apache.maven.plugin.DefaultBuildPluginManager.executeMojo(DefaultBuildPluginManager.java:137)
	at org.apache.maven.lifecycle.internal.MojoExecutor.execute(MojoExecutor.java:210)
	at org.apache.maven.lifecycle.internal.MojoExecutor.execute(MojoExecutor.java:156)
	at org.apache.maven.lifecycle.internal.MojoExecutor.execute(MojoExecutor.java:148)
	at org.apache.maven.lifecycle.internal.LifecycleModuleBuilder.buildProject(LifecycleModuleBuilder.java:117)
	at org.apache.maven.lifecycle.internal.LifecycleModuleBuilder.buildProject(LifecycleModuleBuilder.java:81)
	at org.apache.maven.lifecycle.internal.builder.singlethreaded.SingleThreadedBuilder.build(SingleThreadedBuilder.java:56)
	at org.apache.maven.lifecycle.internal.LifecycleStarter.execute(LifecycleStarter.java:128)
	at org.apache.maven.DefaultMaven.doExecute(DefaultMaven.java:305)
	at org.apache.maven.DefaultMaven.doExecute(DefaultMaven.java:192)
	at org.apache.maven.DefaultMaven.execute(DefaultMaven.java:105)
	at org.jvnet.hudson.maven3.launcher.Maven35Launcher.main(Maven35Launcher.java:130)
	at sun.reflect.NativeMethodAccessorImpl.invoke0(Native Method)
	at sun.reflect.NativeMethodAccessorImpl.invoke(NativeMethodAccessorImpl.java:62)
	at sun.reflect.DelegatingMethodAccessorImpl.invoke(DelegatingMethodAccessorImpl.java:43)
	at java.lang.reflect.Method.invoke(Method.java:498)
	at org.codehaus.plexus.classworlds.launcher.Launcher.launchEnhanced(Launcher.java:282)
	at org.codehaus.plexus.classworlds.launcher.Launcher.launch(Launcher.java:225)
	at jenkins.maven3.agent.Maven35Main.launch(Maven35Main.java:176)
	at sun.reflect.NativeMethodAccessorImpl.invoke0(Native Method)
	at sun.reflect.NativeMethodAccessorImpl.invoke(NativeMethodAccessorImpl.java:62)
	at sun.reflect.DelegatingMethodAccessorImpl.invoke(DelegatingMethodAccessorImpl.java:43)
	at java.lang.reflect.Method.invoke(Method.java:498)
	at hudson.maven.Maven3Builder.call(Maven3Builder.java:139)
	at hudson.maven.Maven3Builder.call(Maven3Builder.java:70)
	at hudson.remoting.UserRequest.perform(UserRequest.java:212)
	at hudson.remoting.UserRequest.perform(UserRequest.java:54)
	at hudson.remoting.Request$2.run(Request.java:369)
	at hudson.remoting.InterceptingExecutorService$1.call(InterceptingExecutorService.java:72)
	at java.util.concurrent.FutureTask.run(FutureTask.java:266)
	at java.util.concurrent.ThreadPoolExecutor.runWorker(ThreadPoolExecutor.java:1149)
	at java.util.concurrent.ThreadPoolExecutor$Worker.run(ThreadPoolExecutor.java:624)
	at java.lang.Thread.run(Thread.java:748)
Caused by: org.pitest.util.PitError: null

Please copy and paste the information and the complete stacktrace below when reporting an issue
VM : Java HotSpot(TM) 64-Bit Server VM
Vendor : Oracle Corporation
Version : 25.181-b13
Uptime : 2236590
Input -> 
 1 : -Dfile.encoding=UTF-8
 2 : -Djmri.skipschematests=true
BootClassPathSupported : true

	at org.pitest.util.Unchecked.translateCheckedException(Unchecked.java:20)
	at org.pitest.util.SafeDataInputStream.readLong(SafeDataInputStream.java:97)
	at org.pitest.coverage.execute.Receive.readProbeHit(Receive.java:83)
	at org.pitest.coverage.execute.Receive.handleTestEnd(Receive.java:75)
	at org.pitest.coverage.execute.Receive.apply(Receive.java:45)
	at org.pitest.util.SocketReadingCallable.receiveResults(SocketReadingCallable.java:57)
	at org.pitest.util.SocketReadingCallable.call(SocketReadingCallable.java:35)
	at org.pitest.util.SocketReadingCallable.call(SocketReadingCallable.java:12)
	at java.util.concurrent.FutureTask.run(FutureTask.java:266)
	... 1 more
Caused by: java.io.EOFException
	at java.io.DataInputStream.readFully(DataInputStream.java:197)
	at java.io.DataInputStream.readLong(DataInputStream.java:416)
	at org.pitest.util.SafeDataInputStream.readLong(SafeDataInputStream.java:95)
	... 8 more
1:24:58 AM PIT >> SEVERE : Coverage generator Minion exited abnormally due to UNKNOWN_ERROR
[BFA] Scanning build for known causes...
[BFA] No failure causes found
[BFA] Done. 0s
[INFO] ------------------------------------------------------------------------
[INFO] BUILD FAILURE
[INFO] ------------------------------------------------------------------------
[INFO] Total time:  37:11 min
[INFO] Finished at: 2020-01-25T01:24:58Z
[INFO] ------------------------------------------------------------------------
Waiting for Jenkins to finish collecting data
[ERROR] Failed to execute goal org.pitest:pitest-maven:1.4.10:mutationCoverage (default-cli) on project jmri: Execution default-cli of goal org.pitest:pitest-maven:1.4.10:mutationCoverage failed: Coverage generation minion exited abnormally!
[ERROR] 
[ERROR] Please copy and paste the information and the complete stacktrace below when reporting an issue
[ERROR] VM : Java HotSpot(TM) 64-Bit Server VM
[ERROR] Vendor : Oracle Corporation
[ERROR] Version : 25.181-b13
[ERROR] Uptime : 2236594
[ERROR] Input ->
[ERROR] 1 : -Dfile.encoding=UTF-8
[ERROR] 2 : -Djmri.skipschematests=true
[ERROR] BootClassPathSupported : true
[ERROR] 
[ERROR] 
[ERROR] Please copy and paste the information and the complete stacktrace below when reporting an issue
[ERROR] VM : Java HotSpot(TM) 64-Bit Server VM
[ERROR] Vendor : Oracle Corporation
[JENKINS] Archiving /var/lib/jenkins/jobs/Development/jobs/PIT/workspace/pom.xml to org.jmri/jmri/4.19.3-SNAPSHOT/jmri-4.19.3-SNAPSHOT.pom
[ERROR] Version : 25.181-b13
[ERROR] Uptime : 2236594
[ERROR] Input ->
[ERROR] 1 : -Dfile.encoding=UTF-8
[ERROR] 2 : -Djmri.skipschematests=true
[ERROR] BootClassPathSupported : true
[ERROR] -> [Help 1]
[ERROR] 
[ERROR] To see the full stack trace of the errors, re-run Maven with the -e switch.
[ERROR] Re-run Maven using the -X switch to enable full debug logging.
[ERROR] 
[ERROR] For more information about the errors and possible solutions, please read the following articles:
[ERROR] [Help 1] http://cwiki.apache.org/confluence/display/MAVEN/PluginExecutionException
Xvfb stopping
channel stopped
Looking for PIT reports in /var/lib/jenkins/jobs/Development/jobs/PIT/workspace
ERROR: Step ‘Record Pit mutation testing report’ aborted due to exception: 
java.io.IOException: No reports found at location:target/pit-reports/**/mutations.xml 
	at org.jenkinsci.plugins.pitmutation.PitPublisher$ParseReportCallable.invoke(PitPublisher.java:338)
	at org.jenkinsci.plugins.pitmutation.PitPublisher$ParseReportCallable.invoke(PitPublisher.java:320)
	at hudson.FilePath.act(FilePath.java:1078)
	at hudson.FilePath.act(FilePath.java:1061)
	at org.jenkinsci.plugins.pitmutation.PitPublisher.perform(PitPublisher.java:91)
	at hudson.tasks.BuildStepCompatibilityLayer.perform(BuildStepCompatibilityLayer.java:79)
	at hudson.tasks.BuildStepMonitor$3.perform(BuildStepMonitor.java:45)
	at hudson.model.AbstractBuild$AbstractBuildExecution.perform(AbstractBuild.java:741)
	at hudson.model.AbstractBuild$AbstractBuildExecution.performAllBuildSteps(AbstractBuild.java:690)
	at hudson.maven.MavenModuleSetBuild$MavenModuleSetBuildExecution.post2(MavenModuleSetBuild.java:1073)
	at hudson.model.AbstractBuild$AbstractBuildExecution.post(AbstractBuild.java:635)
	at hudson.model.Run.execute(Run.java:1840)
	at hudson.maven.MavenModuleSetBuild.run(MavenModuleSetBuild.java:543)
	at hudson.model.ResourceController.execute(ResourceController.java:97)
	at hudson.model.Executor.run(Executor.java:429)
[BFA] Scanning build for known causes...
[BFA] No failure causes found
[BFA] Done. 0s
Finished: FAILURE