FailedConsole Output

Skipping 385 KB.. Full Log
.MqttTurnoutManagerTest
[INFO] Tests run: 1, Failures: 0, Errors: 0, Skipped: 0, Time elapsed: 0 s - in jmri.jmrix.mqtt.MqttTurnoutManagerTest
[INFO] Running jmri.jmrix.mqtt.MqttSystemConnectionMemoTest
[INFO] Tests run: 1, Failures: 0, Errors: 0, Skipped: 0, Time elapsed: 0 s - in jmri.jmrix.mqtt.MqttSystemConnectionMemoTest
[INFO] Running jmri.jmrix.mqtt.MqttAdapterTest
[INFO] Tests run: 1, Failures: 0, Errors: 0, Skipped: 0, Time elapsed: 0 s - in jmri.jmrix.mqtt.MqttAdapterTest
[INFO] Running jmri.jmrix.mqtt.MqttConnectionTypeListTest
[INFO] Tests run: 1, Failures: 0, Errors: 0, Skipped: 0, Time elapsed: 0 s - in jmri.jmrix.mqtt.MqttConnectionTypeListTest
[INFO] Running jmri.jmrix.NetMessageTest
[INFO] Tests run: 1, Failures: 0, Errors: 0, Skipped: 0, Time elapsed: 0 s - in jmri.jmrix.NetMessageTest
[INFO] Running jmri.jmrix.tams.configurexml.TamsSensorManagerXmlTest
[INFO] Tests run: 1, Failures: 0, Errors: 0, Skipped: 0, Time elapsed: 0 s - in jmri.jmrix.tams.configurexml.TamsSensorManagerXmlTest
[INFO] Running jmri.jmrix.tams.configurexml.TamsTurnoutManagerXmlTest
[INFO] Tests run: 1, Failures: 0, Errors: 0, Skipped: 0, Time elapsed: 0 s - in jmri.jmrix.tams.configurexml.TamsTurnoutManagerXmlTest
[INFO] Running jmri.jmrix.tams.serialdriver.ConnectionConfigTest
[WARNING] Tests run: 8, Failures: 0, Errors: 0, Skipped: 5, Time elapsed: 0.06 s - in jmri.jmrix.tams.serialdriver.ConnectionConfigTest
[INFO] Running jmri.jmrix.tams.serialdriver.configurexml.ConnectionConfigXmlTest
[INFO] Tests run: 4, Failures: 0, Errors: 0, Skipped: 0, Time elapsed: 0.048 s - in jmri.jmrix.tams.serialdriver.configurexml.ConnectionConfigXmlTest
[INFO] Running jmri.jmrix.tams.serialdriver.BundleTest
[INFO] Tests run: 2, Failures: 0, Errors: 0, Skipped: 0, Time elapsed: 0 s - in jmri.jmrix.tams.serialdriver.BundleTest
[INFO] Running jmri.jmrix.tams.serialdriver.SerialDriverAdapterTest
[INFO] Tests run: 1, Failures: 0, Errors: 0, Skipped: 0, Time elapsed: 0 s - in jmri.jmrix.tams.serialdriver.SerialDriverAdapterTest
[INFO] Running jmri.jmrix.tams.TamsProgrammerManagerTest
[INFO] Tests run: 1, Failures: 0, Errors: 0, Skipped: 0, Time elapsed: 0.004 s - in jmri.jmrix.tams.TamsProgrammerManagerTest
[INFO] Running jmri.jmrix.tams.swing.TamsNamedPaneActionTest
[INFO] Tests run: 1, Failures: 0, Errors: 0, Skipped: 0, Time elapsed: 0.012 s - in jmri.jmrix.tams.swing.TamsNamedPaneActionTest
[INFO] Running jmri.jmrix.tams.swing.locodatabase.BundleTest
[INFO] Tests run: 2, Failures: 0, Errors: 0, Skipped: 0, Time elapsed: 0.005 s - in jmri.jmrix.tams.swing.locodatabase.BundleTest
[INFO] Running jmri.jmrix.tams.swing.locodatabase.LocoDataModelTest
[INFO] Tests run: 1, Failures: 0, Errors: 0, Skipped: 0, Time elapsed: 0.007 s - in jmri.jmrix.tams.swing.locodatabase.LocoDataModelTest
[INFO] Running jmri.jmrix.tams.swing.locodatabase.LocoDataPaneTest
[INFO] Tests run: 4, Failures: 0, Errors: 0, Skipped: 0, Time elapsed: 0.031 s - in jmri.jmrix.tams.swing.locodatabase.LocoDataPaneTest
[INFO] Running jmri.jmrix.tams.swing.statusframe.BundleTest
[INFO] Tests run: 2, Failures: 0, Errors: 0, Skipped: 0, Time elapsed: 0 s - in jmri.jmrix.tams.swing.statusframe.BundleTest
[INFO] Running jmri.jmrix.tams.swing.statusframe.StatusPanelTest
[INFO] Tests run: 1, Failures: 0, Errors: 0, Skipped: 0, Time elapsed: 0.002 s - in jmri.jmrix.tams.swing.statusframe.StatusPanelTest
[INFO] Running jmri.jmrix.tams.swing.TamsComponentFactoryTest
[INFO] Tests run: 1, Failures: 0, Errors: 0, Skipped: 0, Time elapsed: 0 s - in jmri.jmrix.tams.swing.TamsComponentFactoryTest
[INFO] Running jmri.jmrix.tams.swing.BundleTest
[INFO] Tests run: 2, Failures: 0, Errors: 0, Skipped: 0, Time elapsed: 0.004 s - in jmri.jmrix.tams.swing.BundleTest
[INFO] Running jmri.jmrix.tams.swing.TamsMenuTest
[INFO] Tests run: 1, Failures: 0, Errors: 0, Skipped: 0, Time elapsed: 0 s - in jmri.jmrix.tams.swing.TamsMenuTest
[INFO] Running jmri.jmrix.tams.swing.packetgen.PacketGenPanelTest
[INFO] Tests run: 4, Failures: 0, Errors: 0, Skipped: 0, Time elapsed: 0.005 s - in jmri.jmrix.tams.swing.packetgen.PacketGenPanelTest
[INFO] Running jmri.jmrix.tams.swing.packetgen.BundleTest
[INFO] Tests run: 2, Failures: 0, Errors: 0, Skipped: 0, Time elapsed: 0 s - in jmri.jmrix.tams.swing.packetgen.BundleTest
[INFO] Running jmri.jmrix.tams.swing.monitor.BundleTest
[INFO] Tests run: 2, Failures: 0, Errors: 0, Skipped: 0, Time elapsed: 0 s - in jmri.jmrix.tams.swing.monitor.BundleTest
[INFO] Running jmri.jmrix.tams.swing.monitor.TamsMonPaneTest
[INFO] Tests run: 13, Failures: 0, Errors: 0, Skipped: 0, Time elapsed: 1.127 s - in jmri.jmrix.tams.swing.monitor.TamsMonPaneTest
[INFO] Running jmri.jmrix.tams.TamsOpsModeProgrammerTest
[INFO] Tests run: 14, Failures: 0, Errors: 0, Skipped: 0, Time elapsed: 0.01 s - in jmri.jmrix.tams.TamsOpsModeProgrammerTest
[INFO] Running jmri.jmrix.tams.TamsTurnoutTest
[INFO] Tests run: 16, Failures: 0, Errors: 0, Skipped: 0, Time elapsed: 0.029 s - in jmri.jmrix.tams.TamsTurnoutTest
[INFO] Running jmri.jmrix.tams.TamsPortControllerTest
[INFO] Tests run: 1, Failures: 0, Errors: 0, Skipped: 0, Time elapsed: 0.002 s - in jmri.jmrix.tams.TamsPortControllerTest
[INFO] Running jmri.jmrix.tams.TamsConnectionTypeListTest
[INFO] Tests run: 1, Failures: 0, Errors: 0, Skipped: 0, Time elapsed: 0 s - in jmri.jmrix.tams.TamsConnectionTypeListTest
[INFO] Running jmri.jmrix.tams.BundleTest
[INFO] Tests run: 2, Failures: 0, Errors: 0, Skipped: 0, Time elapsed: 0 s - in jmri.jmrix.tams.BundleTest
[INFO] Running jmri.jmrix.tams.TamsPowerManagerTest
[INFO] Tests run: 1, Failures: 0, Errors: 0, Skipped: 0, Time elapsed: 0.001 s - in jmri.jmrix.tams.TamsPowerManagerTest
[INFO] Running jmri.jmrix.tams.TamsTrafficControllerTest
[INFO] Tests run: 6, Failures: 0, Errors: 0, Skipped: 0, Time elapsed: 0.001 s - in jmri.jmrix.tams.TamsTrafficControllerTest
[INFO] Running jmri.jmrix.tams.TamsTurnoutManagerTest
[WARNING] Tests run: 20, Failures: 0, Errors: 0, Skipped: 1, Time elapsed: 0.043 s - in jmri.jmrix.tams.TamsTurnoutManagerTest
[INFO] Running jmri.jmrix.tams.TamsThrottleTest
[INFO] Tests run: 151, Failures: 0, Errors: 0, Skipped: 0, Time elapsed: 0.224 s - in jmri.jmrix.tams.TamsThrottleTest
[INFO] Running jmri.jmrix.tams.TamsConstantsTest
[INFO] Tests run: 1, Failures: 0, Errors: 0, Skipped: 0, Time elapsed: 0.001 s - in jmri.jmrix.tams.TamsConstantsTest
[INFO] Running jmri.jmrix.tams.TamsThrottleManagerTest
[INFO] Tests run: 17, Failures: 0, Errors: 0, Skipped: 0, Time elapsed: 0.022 s - in jmri.jmrix.tams.TamsThrottleManagerTest
[INFO] Running jmri.jmrix.tams.TamsSystemConnectionMemoTest
[INFO] Tests run: 10, Failures: 0, Errors: 0, Skipped: 0, Time elapsed: 0.018 s - in jmri.jmrix.tams.TamsSystemConnectionMemoTest
[INFO] Running jmri.jmrix.tams.TamsMessageTest
[INFO] Tests run: 3, Failures: 0, Errors: 0, Skipped: 0, Time elapsed: 0 s - in jmri.jmrix.tams.TamsMessageTest
[INFO] Running jmri.jmrix.tams.TamsProgrammerTest
[INFO] Tests run: 12, Failures: 0, Errors: 0, Skipped: 0, Time elapsed: 0.01 s - in jmri.jmrix.tams.TamsProgrammerTest
[INFO] Running jmri.jmrix.tams.TamsReplyTest
[INFO] Tests run: 3, Failures: 0, Errors: 0, Skipped: 0, Time elapsed: 0.001 s - in jmri.jmrix.tams.TamsReplyTest
[INFO] Running jmri.jmrix.tams.simulator.ConnectionConfigTest
[WARNING] Tests run: 8, Failures: 0, Errors: 0, Skipped: 5, Time elapsed: 0.012 s - in jmri.jmrix.tams.simulator.ConnectionConfigTest
[INFO] Running jmri.jmrix.tams.simulator.configurexml.ConnectionConfigXmlTest
[INFO] Tests run: 4, Failures: 0, Errors: 0, Skipped: 0, Time elapsed: 0.019 s - in jmri.jmrix.tams.simulator.configurexml.ConnectionConfigXmlTest
[INFO] Running jmri.jmrix.tams.simulator.BundleTest
[INFO] Tests run: 2, Failures: 0, Errors: 0, Skipped: 0, Time elapsed: 0 s - in jmri.jmrix.tams.simulator.BundleTest
[INFO] Running jmri.jmrix.tams.simulator.SimulatorAdapterTest
[INFO] Tests run: 1, Failures: 0, Errors: 0, Skipped: 0, Time elapsed: 0.001 s - in jmri.jmrix.tams.simulator.SimulatorAdapterTest
[INFO] Running jmri.jmrix.tams.TamsSensorTest
[INFO] Tests run: 14, Failures: 0, Errors: 0, Skipped: 0, Time elapsed: 0.143 s - in jmri.jmrix.tams.TamsSensorTest
[INFO] Running jmri.jmrix.tams.TamsSensorManagerTest
[WARNING] Tests run: 22, Failures: 0, Errors: 0, Skipped: 1, Time elapsed: 0.027 s - in jmri.jmrix.tams.TamsSensorManagerTest
[INFO] Running jmri.jmrix.AbstractMonPaneTest
[INFO] Tests run: 4, Failures: 0, Errors: 0, Skipped: 0, Time elapsed: 0.039 s - in jmri.jmrix.AbstractMonPaneTest
[INFO] Running jmri.jmrix.powerline.SerialTurnoutTest
[WARNING] Tests run: 16, Failures: 0, Errors: 0, Skipped: 3, Time elapsed: 0.173 s - in jmri.jmrix.powerline.SerialTurnoutTest
[INFO] Running jmri.jmrix.powerline.configurexml.SerialLightManagerXmlTest
[INFO] Tests run: 1, Failures: 0, Errors: 0, Skipped: 0, Time elapsed: 0 s - in jmri.jmrix.powerline.configurexml.SerialLightManagerXmlTest
[INFO] Running jmri.jmrix.powerline.configurexml.SerialSensorManagerXmlTest
[INFO] Tests run: 1, Failures: 0, Errors: 0, Skipped: 0, Time elapsed: 0 s - in jmri.jmrix.powerline.configurexml.SerialSensorManagerXmlTest
[INFO] Running jmri.jmrix.powerline.configurexml.SerialTurnoutManagerXmlTest
[INFO] Tests run: 1, Failures: 0, Errors: 0, Skipped: 0, Time elapsed: 0 s - in jmri.jmrix.powerline.configurexml.SerialTurnoutManagerXmlTest
[INFO] Running jmri.jmrix.powerline.SerialAddressTest
[INFO] Tests run: 5, Failures: 0, Errors: 0, Skipped: 0, Time elapsed: 0.014 s - in jmri.jmrix.powerline.SerialAddressTest
[INFO] Running jmri.jmrix.powerline.serialdriver.ConnectionConfigTest
[WARNING] Tests run: 8, Failures: 0, Errors: 0, Skipped: 5, Time elapsed: 0.036 s - in jmri.jmrix.powerline.serialdriver.ConnectionConfigTest
[INFO] Running jmri.jmrix.powerline.serialdriver.configurexml.ConnectionConfigXmlTest
[INFO] Tests run: 4, Failures: 0, Errors: 0, Skipped: 0, Time elapsed: 0.038 s - in jmri.jmrix.powerline.serialdriver.configurexml.ConnectionConfigXmlTest
[INFO] Running jmri.jmrix.powerline.serialdriver.BundleTest
[INFO] Tests run: 2, Failures: 0, Errors: 0, Skipped: 0, Time elapsed: 0 s - in jmri.jmrix.powerline.serialdriver.BundleTest
[INFO] Running jmri.jmrix.powerline.serialdriver.SerialDriverAdapterTest
[INFO] Tests run: 1, Failures: 0, Errors: 0, Skipped: 0, Time elapsed: 0 s - in jmri.jmrix.powerline.serialdriver.SerialDriverAdapterTest
[INFO] Running jmri.jmrix.powerline.swing.PowerlineMenuTest
[INFO] Tests run: 1, Failures: 0, Errors: 0, Skipped: 0, Time elapsed: 0.003 s - in jmri.jmrix.powerline.swing.PowerlineMenuTest
[INFO] Running jmri.jmrix.powerline.swing.BundleTest
[INFO] Tests run: 2, Failures: 0, Errors: 0, Skipped: 0, Time elapsed: 0 s - in jmri.jmrix.powerline.swing.BundleTest
[INFO] Running jmri.jmrix.powerline.swing.PowerlineNamedPaneActionTest
[INFO] Tests run: 1, Failures: 0, Errors: 0, Skipped: 0, Time elapsed: 0.012 s - in jmri.jmrix.powerline.swing.PowerlineNamedPaneActionTest
[INFO] Running jmri.jmrix.powerline.swing.serialmon.SerialMonPaneTest
[INFO] Tests run: 13, Failures: 0, Errors: 0, Skipped: 0, Time elapsed: 1.126 s - in jmri.jmrix.powerline.swing.serialmon.SerialMonPaneTest
[INFO] Running jmri.jmrix.powerline.swing.serialmon.SerialMonActionTest
[INFO] Tests run: 2, Failures: 0, Errors: 0, Skipped: 0, Time elapsed: 0.002 s - in jmri.jmrix.powerline.swing.serialmon.SerialMonActionTest
[INFO] Running jmri.jmrix.powerline.swing.serialmon.BundleTest
[INFO] Tests run: 2, Failures: 0, Errors: 0, Skipped: 0, Time elapsed: 0 s - in jmri.jmrix.powerline.swing.serialmon.BundleTest
[INFO] Running jmri.jmrix.powerline.swing.serialmon.SerialMonFrameTest
[INFO] Tests run: 1, Failures: 0, Errors: 0, Skipped: 0, Time elapsed: 0.009 s - in jmri.jmrix.powerline.swing.serialmon.SerialMonFrameTest
[INFO] Running jmri.jmrix.powerline.swing.packetgen.BundleTest
[INFO] Tests run: 2, Failures: 0, Errors: 0, Skipped: 0, Time elapsed: 0.005 s - in jmri.jmrix.powerline.swing.packetgen.BundleTest
[INFO] Running jmri.jmrix.powerline.swing.packetgen.SerialPacketGenActionTest
[INFO] Tests run: 2, Failures: 0, Errors: 0, Skipped: 0, Time elapsed: 0.001 s - in jmri.jmrix.powerline.swing.packetgen.SerialPacketGenActionTest
[INFO] Running jmri.jmrix.powerline.swing.packetgen.SerialPacketGenPaneTest
[INFO] Tests run: 4, Failures: 0, Errors: 0, Skipped: 0, Time elapsed: 0.003 s - in jmri.jmrix.powerline.swing.packetgen.SerialPacketGenPaneTest
[INFO] Running jmri.jmrix.powerline.swing.packetgen.SerialPacketGenFrameTest
[INFO] Tests run: 2, Failures: 0, Errors: 0, Skipped: 0, Time elapsed: 0.057 s - in jmri.jmrix.powerline.swing.packetgen.SerialPacketGenFrameTest
[INFO] Running jmri.jmrix.powerline.swing.PowerlineComponentFactoryTest
[INFO] Tests run: 1, Failures: 0, Errors: 0, Skipped: 0, Time elapsed: 0.003 s - in jmri.jmrix.powerline.swing.PowerlineComponentFactoryTest
[INFO] Running jmri.jmrix.powerline.SerialX10LightTest
[INFO] Tests run: 1, Failures: 0, Errors: 0, Skipped: 0, Time elapsed: 0.008 s - in jmri.jmrix.powerline.SerialX10LightTest
[INFO] Running jmri.jmrix.powerline.cm11.SpecificReplyTest
[INFO] Tests run: 3, Failures: 0, Errors: 0, Skipped: 0, Time elapsed: 0.012 s - in jmri.jmrix.powerline.cm11.SpecificReplyTest
[INFO] Running jmri.jmrix.powerline.cm11.ConnectionConfigTest
[WARNING] Tests run: 8, Failures: 0, Errors: 0, Skipped: 5, Time elapsed: 0.04 s - in jmri.jmrix.powerline.cm11.ConnectionConfigTest
[INFO] Running jmri.jmrix.powerline.cm11.configurexml.SpecificLightManagerXmlTest
[INFO] Tests run: 1, Failures: 0, Errors: 0, Skipped: 0, Time elapsed: 0 s - in jmri.jmrix.powerline.cm11.configurexml.SpecificLightManagerXmlTest
[INFO] Running jmri.jmrix.powerline.cm11.configurexml.ConnectionConfigXmlTest
[INFO] Tests run: 4, Failures: 0, Errors: 0, Skipped: 0, Time elapsed: 0.042 s - in jmri.jmrix.powerline.cm11.configurexml.ConnectionConfigXmlTest
[INFO] Running jmri.jmrix.powerline.cm11.configurexml.SpecificSensorManagerXmlTest
[INFO] Tests run: 1, Failures: 0, Errors: 0, Skipped: 0, Time elapsed: 0.003 s - in jmri.jmrix.powerline.cm11.configurexml.SpecificSensorManagerXmlTest
[INFO] Running jmri.jmrix.powerline.cm11.SpecificDriverAdapterTest
[INFO] Tests run: 1, Failures: 0, Errors: 0, Skipped: 0, Time elapsed: 0 s - in jmri.jmrix.powerline.cm11.SpecificDriverAdapterTest
[INFO] Running jmri.jmrix.powerline.cm11.BundleTest
[INFO] Tests run: 2, Failures: 0, Errors: 0, Skipped: 0, Time elapsed: 0 s - in jmri.jmrix.powerline.cm11.BundleTest
[INFO] Running jmri.jmrix.powerline.cm11.SpecificMessageTest
[INFO] Tests run: 2, Failures: 0, Errors: 0, Skipped: 0, Time elapsed: 0.001 s - in jmri.jmrix.powerline.cm11.SpecificMessageTest
[INFO] Running jmri.jmrix.powerline.cm11.SpecificTrafficControllerTest
[INFO] Tests run: 9, Failures: 0, Errors: 0, Skipped: 0, Time elapsed: 0.022 s - in jmri.jmrix.powerline.cm11.SpecificTrafficControllerTest
[INFO] Running jmri.jmrix.powerline.cm11.ConstantsTest
[INFO] Tests run: 1, Failures: 0, Errors: 0, Skipped: 0, Time elapsed: 0.001 s - in jmri.jmrix.powerline.cm11.ConstantsTest
[INFO] Running jmri.jmrix.powerline.cm11.SpecificLightManagerTest
[INFO] Tests run: 1, Failures: 0, Errors: 0, Skipped: 0, Time elapsed: 0 s - in jmri.jmrix.powerline.cm11.SpecificLightManagerTest
[INFO] Running jmri.jmrix.powerline.cm11.SpecificLightTest
[INFO] Tests run: 1, Failures: 0, Errors: 0, Skipped: 0, Time elapsed: 0.008 s - in jmri.jmrix.powerline.cm11.SpecificLightTest
[INFO] Running jmri.jmrix.powerline.cm11.SpecificSystemConnectionMemoTest
[INFO] Tests run: 10, Failures: 0, Errors: 0, Skipped: 0, Time elapsed: 0.019 s - in jmri.jmrix.powerline.cm11.SpecificSystemConnectionMemoTest
[INFO] Running jmri.jmrix.powerline.cm11.SpecificSensorManagerTest
[INFO] Tests run: 1, Failures: 0, Errors: 0, Skipped: 0, Time elapsed: 0.001 s - in jmri.jmrix.powerline.cm11.SpecificSensorManagerTest
[INFO] Running jmri.jmrix.powerline.SerialTurnoutManagerTest
[WARNING] Tests run: 20, Failures: 0, Errors: 0, Skipped: 1, Time elapsed: 0.042 s - in jmri.jmrix.powerline.SerialTurnoutManagerTest
[INFO] Running jmri.jmrix.powerline.BundleTest
[INFO] Tests run: 2, Failures: 0, Errors: 0, Skipped: 0, Time elapsed: 0 s - in jmri.jmrix.powerline.BundleTest
[INFO] Running jmri.jmrix.powerline.InsteonSequenceTest
[INFO] Tests run: 1, Failures: 0, Errors: 0, Skipped: 0, Time elapsed: 0 s - in jmri.jmrix.powerline.InsteonSequenceTest
[INFO] Running jmri.jmrix.powerline.insteon2412s.SpecificReplyTest
[INFO] Tests run: 3, Failures: 0, Errors: 0, Skipped: 0, Time elapsed: 0.011 s - in jmri.jmrix.powerline.insteon2412s.SpecificReplyTest
[INFO] Running jmri.jmrix.powerline.insteon2412s.ConnectionConfigTest
[WARNING] Tests run: 8, Failures: 0, Errors: 0, Skipped: 5, Time elapsed: 0.035 s - in jmri.jmrix.powerline.insteon2412s.ConnectionConfigTest
[INFO] Running jmri.jmrix.powerline.insteon2412s.configurexml.SpecificLightManagerXmlTest
[INFO] Tests run: 1, Failures: 0, Errors: 0, Skipped: 0, Time elapsed: 0 s - in jmri.jmrix.powerline.insteon2412s.configurexml.SpecificLightManagerXmlTest
[INFO] Running jmri.jmrix.powerline.insteon2412s.configurexml.ConnectionConfigXmlTest
[INFO] Tests run: 4, Failures: 0, Errors: 0, Skipped: 0, Time elapsed: 0.037 s - in jmri.jmrix.powerline.insteon2412s.configurexml.ConnectionConfigXmlTest
[INFO] Running jmri.jmrix.powerline.insteon2412s.configurexml.SpecificSensorManagerXmlTest
[INFO] Tests run: 1, Failures: 0, Errors: 0, Skipped: 0, Time elapsed: 0 s - in jmri.jmrix.powerline.insteon2412s.configurexml.SpecificSensorManagerXmlTest
[INFO] Running jmri.jmrix.powerline.insteon2412s.SpecificDriverAdapterTest
[INFO] Tests run: 1, Failures: 0, Errors: 0, Skipped: 0, Time elapsed: 0.001 s - in jmri.jmrix.powerline.insteon2412s.SpecificDriverAdapterTest
[INFO] Running jmri.jmrix.powerline.insteon2412s.SpecificInsteonLightTest
[INFO] Tests run: 1, Failures: 0, Errors: 0, Skipped: 0, Time elapsed: 0.004 s - in jmri.jmrix.powerline.insteon2412s.SpecificInsteonLightTest
[INFO] Running jmri.jmrix.powerline.insteon2412s.SpecificX10LightTest
[INFO] Tests run: 1, Failures: 0, Errors: 0, Skipped: 0, Time elapsed: 0.004 s - in jmri.jmrix.powerline.insteon2412s.SpecificX10LightTest
[INFO] Running jmri.jmrix.powerline.insteon2412s.BundleTest
[INFO] Tests run: 2, Failures: 0, Errors: 0, Skipped: 0, Time elapsed: 0 s - in jmri.jmrix.powerline.insteon2412s.BundleTest
[INFO] Running jmri.jmrix.powerline.insteon2412s.SpecificMessageTest
[INFO] Tests run: 4, Failures: 0, Errors: 0, Skipped: 0, Time elapsed: 0.001 s - in jmri.jmrix.powerline.insteon2412s.SpecificMessageTest
[INFO] Running jmri.jmrix.powerline.insteon2412s.SpecificTrafficControllerTest
[INFO] Tests run: 8, Failures: 0, Errors: 0, Skipped: 0, Time elapsed: 0.012 s - in jmri.jmrix.powerline.insteon2412s.SpecificTrafficControllerTest
[INFO] Running jmri.jmrix.powerline.insteon2412s.ConstantsTest
[INFO] Tests run: 1, Failures: 0, Errors: 0, Skipped: 0, Time elapsed: 0 s - in jmri.jmrix.powerline.insteon2412s.ConstantsTest
[INFO] Running jmri.jmrix.powerline.insteon2412s.SpecificLightManagerTest
[INFO] Tests run: 1, Failures: 0, Errors: 0, Skipped: 0, Time elapsed: 0 s - in jmri.jmrix.powerline.insteon2412s.SpecificLightManagerTest
[INFO] Running jmri.jmrix.powerline.insteon2412s.SpecificSystemConnectionMemoTest
[INFO] Tests run: 10, Failures: 0, Errors: 0, Skipped: 0, Time elapsed: 0.014 s - in jmri.jmrix.powerline.insteon2412s.SpecificSystemConnectionMemoTest
[INFO] Running jmri.jmrix.powerline.insteon2412s.SpecificSensorManagerTest
[INFO] Tests run: 1, Failures: 0, Errors: 0, Skipped: 0, Time elapsed: 0 s - in jmri.jmrix.powerline.insteon2412s.SpecificSensorManagerTest
[INFO] Running jmri.jmrix.powerline.SerialNodeTest
[INFO] Tests run: 1, Failures: 0, Errors: 0, Skipped: 0, Time elapsed: 0.001 s - in jmri.jmrix.powerline.SerialNodeTest
[INFO] Running jmri.jmrix.powerline.SystemMenuTest
[INFO] Tests run: 1, Failures: 0, Errors: 0, Skipped: 0, Time elapsed: 0.003 s - in jmri.jmrix.powerline.SystemMenuTest
[INFO] Running jmri.jmrix.powerline.SerialSystemConnectionMemoTest
[INFO] Tests run: 10, Failures: 0, Errors: 0, Skipped: 0, Time elapsed: 0.016 s - in jmri.jmrix.powerline.SerialSystemConnectionMemoTest
[INFO] Running jmri.jmrix.powerline.SerialPortControllerTest
[INFO] Tests run: 1, Failures: 0, Errors: 0, Skipped: 0, Time elapsed: 0.002 s - in jmri.jmrix.powerline.SerialPortControllerTest
[INFO] Running jmri.jmrix.powerline.cp290.SpecificReplyTest
[INFO] Tests run: 3, Failures: 0, Errors: 0, Skipped: 0, Time elapsed: 0.008 s - in jmri.jmrix.powerline.cp290.SpecificReplyTest
[INFO] Running jmri.jmrix.powerline.cp290.ConnectionConfigTest
[WARNING] Tests run: 8, Failures: 0, Errors: 0, Skipped: 5, Time elapsed: 0.034 s - in jmri.jmrix.powerline.cp290.ConnectionConfigTest
[INFO] Running jmri.jmrix.powerline.cp290.configurexml.SpecificLightManagerXmlTest
[INFO] Tests run: 1, Failures: 0, Errors: 0, Skipped: 0, Time elapsed: 0 s - in jmri.jmrix.powerline.cp290.configurexml.SpecificLightManagerXmlTest
[INFO] Running jmri.jmrix.powerline.cp290.configurexml.ConnectionConfigXmlTest
[INFO] Tests run: 4, Failures: 0, Errors: 0, Skipped: 0, Time elapsed: 0.031 s - in jmri.jmrix.powerline.cp290.configurexml.ConnectionConfigXmlTest
[INFO] Running jmri.jmrix.powerline.cp290.configurexml.SpecificSensorManagerXmlTest
[INFO] Tests run: 1, Failures: 0, Errors: 0, Skipped: 0, Time elapsed: 0 s - in jmri.jmrix.powerline.cp290.configurexml.SpecificSensorManagerXmlTest
[INFO] Running jmri.jmrix.powerline.cp290.SpecificDriverAdapterTest
[INFO] Tests run: 1, Failures: 0, Errors: 0, Skipped: 0, Time elapsed: 0 s - in jmri.jmrix.powerline.cp290.SpecificDriverAdapterTest
[INFO] Running jmri.jmrix.powerline.cp290.BundleTest
[INFO] Tests run: 2, Failures: 0, Errors: 0, Skipped: 0, Time elapsed: 0 s - in jmri.jmrix.powerline.cp290.BundleTest
[INFO] Running jmri.jmrix.powerline.cp290.SpecificMessageTest
[INFO] Tests run: 3, Failures: 0, Errors: 0, Skipped: 0, Time elapsed: 0 s - in jmri.jmrix.powerline.cp290.SpecificMessageTest
[INFO] Running jmri.jmrix.powerline.cp290.SpecificTrafficControllerTest
[INFO] Tests run: 6, Failures: 0, Errors: 0, Skipped: 0, Time elapsed: 0.007 s - in jmri.jmrix.powerline.cp290.SpecificTrafficControllerTest
[INFO] Running jmri.jmrix.powerline.cp290.ConstantsTest
[INFO] Tests run: 1, Failures: 0, Errors: 0, Skipped: 0, Time elapsed: 0.001 s - in jmri.jmrix.powerline.cp290.ConstantsTest
[INFO] Running jmri.jmrix.powerline.cp290.SpecificLightManagerTest
[INFO] Tests run: 1, Failures: 0, Errors: 0, Skipped: 0, Time elapsed: 0 s - in jmri.jmrix.powerline.cp290.SpecificLightManagerTest
[INFO] Running jmri.jmrix.powerline.cp290.SpecificLightTest
[INFO] Tests run: 1, Failures: 0, Errors: 0, Skipped: 0, Time elapsed: 0.002 s - in jmri.jmrix.powerline.cp290.SpecificLightTest
[INFO] Running jmri.jmrix.powerline.cp290.SpecificSystemConnectionMemoTest
[INFO] Tests run: 10, Failures: 0, Errors: 0, Skipped: 0, Time elapsed: 0.017 s - in jmri.jmrix.powerline.cp290.SpecificSystemConnectionMemoTest
[INFO] Running jmri.jmrix.powerline.cp290.SpecificSensorManagerTest
[INFO] Tests run: 1, Failures: 0, Errors: 0, Skipped: 0, Time elapsed: 0 s - in jmri.jmrix.powerline.cp290.SpecificSensorManagerTest
[INFO] Running jmri.jmrix.powerline.SerialSensorManagerTest
[WARNING] Tests run: 22, Failures: 0, Errors: 0, Skipped: 2, Time elapsed: 0.038 s - in jmri.jmrix.powerline.SerialSensorManagerTest
[INFO] Running jmri.jmrix.powerline.SerialTrafficControllerTest
[INFO] Tests run: 6, Failures: 0, Errors: 0, Skipped: 0, Time elapsed: 0.004 s - in jmri.jmrix.powerline.SerialTrafficControllerTest
[INFO] Running jmri.jmrix.powerline.X10SequenceTest
[INFO] Tests run: 2, Failures: 0, Errors: 0, Skipped: 0, Time elapsed: 0 s - in jmri.jmrix.powerline.X10SequenceTest
[INFO] Running jmri.jmrix.powerline.SerialConnectionTypeListTest
[INFO] Tests run: 1, Failures: 0, Errors: 0, Skipped: 0, Time elapsed: 0 s - in jmri.jmrix.powerline.SerialConnectionTypeListTest
[INFO] Running jmri.jmrix.powerline.SerialSensorTest
[INFO] Tests run: 14, Failures: 0, Errors: 0, Skipped: 0, Time elapsed: 0.139 s - in jmri.jmrix.powerline.SerialSensorTest
[INFO] Running jmri.jmrix.powerline.simulator.SpecificReplyTest
[INFO] Tests run: 3, Failures: 0, Errors: 0, Skipped: 0, Time elapsed: 0.003 s - in jmri.jmrix.powerline.simulator.SpecificReplyTest
[INFO] Running jmri.jmrix.powerline.simulator.ConnectionConfigTest
[WARNING] Tests run: 8, Failures: 0, Errors: 0, Skipped: 5, Time elapsed: 0.015 s - in jmri.jmrix.powerline.simulator.ConnectionConfigTest
[INFO] Running jmri.jmrix.powerline.simulator.configurexml.SpecificLightManagerXmlTest
[INFO] Tests run: 1, Failures: 0, Errors: 0, Skipped: 0, Time elapsed: 0.002 s - in jmri.jmrix.powerline.simulator.configurexml.SpecificLightManagerXmlTest
[INFO] Running jmri.jmrix.powerline.simulator.configurexml.ConnectionConfigXmlTest
[INFO] Tests run: 4, Failures: 0, Errors: 0, Skipped: 0, Time elapsed: 0.017 s - in jmri.jmrix.powerline.simulator.configurexml.ConnectionConfigXmlTest
[INFO] Running jmri.jmrix.powerline.simulator.configurexml.SpecificSensorManagerXmlTest
[INFO] Tests run: 1, Failures: 0, Errors: 0, Skipped: 0, Time elapsed: 0 s - in jmri.jmrix.powerline.simulator.configurexml.SpecificSensorManagerXmlTest
[INFO] Running jmri.jmrix.powerline.simulator.SpecificInsteonLightTest
[INFO] Tests run: 1, Failures: 0, Errors: 0, Skipped: 0, Time elapsed: 0.005 s - in jmri.jmrix.powerline.simulator.SpecificInsteonLightTest
[INFO] Running jmri.jmrix.powerline.simulator.SpecificX10LightTest
[INFO] Tests run: 1, Failures: 0, Errors: 0, Skipped: 0, Time elapsed: 0.004 s - in jmri.jmrix.powerline.simulator.SpecificX10LightTest
[INFO] Running jmri.jmrix.powerline.simulator.BundleTest
[INFO] Tests run: 2, Failures: 0, Errors: 0, Skipped: 0, Time elapsed: 0 s - in jmri.jmrix.powerline.simulator.BundleTest
[INFO] Running jmri.jmrix.powerline.simulator.SpecificMessageTest
[INFO] Tests run: 4, Failures: 0, Errors: 0, Skipped: 0, Time elapsed: 0.001 s - in jmri.jmrix.powerline.simulator.SpecificMessageTest
[INFO] Running jmri.jmrix.powerline.simulator.SpecificTrafficControllerTest
[INFO] Tests run: 8, Failures: 0, Errors: 0, Skipped: 0, Time elapsed: 0.011 s - in jmri.jmrix.powerline.simulator.SpecificTrafficControllerTest
[INFO] Running jmri.jmrix.powerline.simulator.ConstantsTest
[INFO] Tests run: 1, Failures: 0, Errors: 0, Skipped: 0, Time elapsed: 0 s - in jmri.jmrix.powerline.simulator.ConstantsTest
[INFO] Running jmri.jmrix.powerline.simulator.SimulatorAdapterTest
[INFO] Tests run: 1, Failures: 0, Errors: 0, Skipped: 0, Time elapsed: 0 s - in jmri.jmrix.powerline.simulator.SimulatorAdapterTest
[INFO] Running jmri.jmrix.powerline.simulator.SpecificLightManagerTest
[INFO] Tests run: 1, Failures: 0, Errors: 0, Skipped: 0, Time elapsed: 0 s - in jmri.jmrix.powerline.simulator.SpecificLightManagerTest
[INFO] Running jmri.jmrix.powerline.simulator.SpecificSystemConnectionMemoTest
[INFO] Tests run: 10, Failures: 0, Errors: 0, Skipped: 0, Time elapsed: 0.018 s - in jmri.jmrix.powerline.simulator.SpecificSystemConnectionMemoTest
[INFO] Running jmri.jmrix.powerline.simulator.SpecificSensorManagerTest
[INFO] Tests run: 1, Failures: 0, Errors: 0, Skipped: 0, Time elapsed: 0 s - in jmri.jmrix.powerline.simulator.SpecificSensorManagerTest
[INFO] Running jmri.jmrix.AbstractMRReplyTest
[INFO] Tests run: 9, Failures: 0, Errors: 0, Skipped: 0, Time elapsed: 0 s - in jmri.jmrix.AbstractMRReplyTest
[INFO] Running jmri.jmrix.swing.SystemConnectionComboBoxTest
[INFO] Tests run: 1, Failures: 0, Errors: 0, Skipped: 0, Time elapsed: 0 s - in jmri.jmrix.swing.SystemConnectionComboBoxTest
[INFO] Running jmri.jmrix.swing.BundleTest
[INFO] Tests run: 2, Failures: 0, Errors: 0, Skipped: 0, Time elapsed: 0 s - in jmri.jmrix.swing.BundleTest
[INFO] Running jmri.jmrix.swing.ConnectionsPreferencesPanelTest
[INFO] Tests run: 1, Failures: 0, Errors: 0, Skipped: 0, Time elapsed: 0.026 s - in jmri.jmrix.swing.ConnectionsPreferencesPanelTest
[INFO] Running jmri.jmrix.sprog.SprogPowerManagerTest
[INFO] Tests run: 12, Failures: 0, Errors: 0, Skipped: 0, Time elapsed: 0.022 s - in jmri.jmrix.sprog.SprogPowerManagerTest
[INFO] Running jmri.jmrix.sprog.configurexml.SprogTurnoutManagerXmlTest
[INFO] Tests run: 1, Failures: 0, Errors: 0, Skipped: 0, Time elapsed: 0 s - in jmri.jmrix.sprog.configurexml.SprogTurnoutManagerXmlTest
[INFO] Running jmri.jmrix.sprog.configurexml.SprogCSStreamConnectionConfigXmlTest
[INFO] Tests run: 4, Failures: 0, Errors: 0, Skipped: 0, Time elapsed: 0.022 s - in jmri.jmrix.sprog.configurexml.SprogCSStreamConnectionConfigXmlTest
[INFO] Running jmri.jmrix.sprog.serialdriver.ConnectionConfigTest
[WARNING] Tests run: 8, Failures: 0, Errors: 0, Skipped: 5, Time elapsed: 0.032 s - in jmri.jmrix.sprog.serialdriver.ConnectionConfigTest
[INFO] Running jmri.jmrix.sprog.serialdriver.configurexml.ConnectionConfigXmlTest
[INFO] Tests run: 4, Failures: 0, Errors: 0, Skipped: 0, Time elapsed: 0.032 s - in jmri.jmrix.sprog.serialdriver.configurexml.ConnectionConfigXmlTest
[INFO] Running jmri.jmrix.sprog.serialdriver.BundleTest
[INFO] Tests run: 2, Failures: 0, Errors: 0, Skipped: 0, Time elapsed: 0 s - in jmri.jmrix.sprog.serialdriver.BundleTest
[INFO] Running jmri.jmrix.sprog.serialdriver.SerialDriverAdapterTest
[INFO] Tests run: 1, Failures: 0, Errors: 0, Skipped: 0, Time elapsed: 0 s - in jmri.jmrix.sprog.serialdriver.SerialDriverAdapterTest
[INFO] Running jmri.jmrix.sprog.SprogCommandStationTest
[INFO] Tests run: 1, Failures: 0, Errors: 0, Skipped: 0, Time elapsed: 0.007 s - in jmri.jmrix.sprog.SprogCommandStationTest
[INFO] Running jmri.jmrix.sprog.swing.SprogComponentFactoryTest
[INFO] Tests run: 1, Failures: 0, Errors: 0, Skipped: 0, Time elapsed: 0 s - in jmri.jmrix.sprog.swing.SprogComponentFactoryTest
[INFO] Running jmri.jmrix.sprog.sprog.ConnectionConfigTest
[WARNING] Tests run: 8, Failures: 0, Errors: 0, Skipped: 5, Time elapsed: 0.042 s - in jmri.jmrix.sprog.sprog.ConnectionConfigTest
[INFO] Running jmri.jmrix.sprog.sprog.configurexml.ConnectionConfigXmlTest
[INFO] Tests run: 4, Failures: 0, Errors: 0, Skipped: 0, Time elapsed: 0.025 s - in jmri.jmrix.sprog.sprog.configurexml.ConnectionConfigXmlTest
[INFO] Running jmri.jmrix.sprog.SprogTurnoutManagerTest
[WARNING] Tests run: 20, Failures: 0, Errors: 0, Skipped: 1, Time elapsed: 0.017 s - in jmri.jmrix.sprog.SprogTurnoutManagerTest
[INFO] Running jmri.jmrix.sprog.SprogCSThrottleTest
[INFO] Tests run: 151, Failures: 0, Errors: 0, Skipped: 0, Time elapsed: 0.199 s - in jmri.jmrix.sprog.SprogCSThrottleTest
[INFO] Running jmri.jmrix.sprog.console.BundleTest
[INFO] Tests run: 2, Failures: 0, Errors: 0, Skipped: 0, Time elapsed: 0 s - in jmri.jmrix.sprog.console.BundleTest
[INFO] Running jmri.jmrix.sprog.console.SprogConsoleActionTest
[INFO] Tests run: 1, Failures: 0, Errors: 0, Skipped: 0, Time elapsed: 0 s - in jmri.jmrix.sprog.console.SprogConsoleActionTest
[INFO] Running jmri.jmrix.sprog.console.SprogConsoleFrameTest
[INFO] Tests run: 2, Failures: 0, Errors: 0, Skipped: 0, Time elapsed: 0.154 s - in jmri.jmrix.sprog.console.SprogConsoleFrameTest
[INFO] Running jmri.jmrix.sprog.SprogOpsModeProgrammerTest
[INFO] Tests run: 14, Failures: 0, Errors: 0, Skipped: 0, Time elapsed: 0.033 s - in jmri.jmrix.sprog.SprogOpsModeProgrammerTest
[INFO] Running jmri.jmrix.sprog.BundleTest
[INFO] Tests run: 2, Failures: 0, Errors: 0, Skipped: 0, Time elapsed: 0.001 s - in jmri.jmrix.sprog.BundleTest
[INFO] Running jmri.jmrix.sprog.SprogTrafficControllerTest
[INFO] Tests run: 1, Failures: 0, Errors: 0, Skipped: 0, Time elapsed: 0.002 s - in jmri.jmrix.sprog.SprogTrafficControllerTest
[INFO] Running jmri.jmrix.sprog.SprogMessageTest
[INFO] Tests run: 7, Failures: 0, Errors: 0, Skipped: 0, Time elapsed: 0.003 s - in jmri.jmrix.sprog.SprogMessageTest
[INFO] Running jmri.jmrix.sprog.update.SprogTypeTest
[INFO] Tests run: 1, Failures: 0, Errors: 0, Skipped: 0, Time elapsed: 0 s - in jmri.jmrix.sprog.update.SprogTypeTest
[INFO] Running jmri.jmrix.sprog.update.SprogVersionFrameTest
[INFO] Tests run: 2, Failures: 0, Errors: 0, Skipped: 0, Time elapsed: 0.066 s - in jmri.jmrix.sprog.update.SprogVersionFrameTest
[INFO] Running jmri.jmrix.sprog.update.SprogVersionTest
[INFO] Tests run: 1, Failures: 0, Errors: 0, Skipped: 0, Time elapsed: 0 s - in jmri.jmrix.sprog.update.SprogVersionTest
[INFO] Running jmri.jmrix.sprog.update.BundleTest
[INFO] Tests run: 2, Failures: 0, Errors: 0, Skipped: 0, Time elapsed: 0 s - in jmri.jmrix.sprog.update.BundleTest
[INFO] Running jmri.jmrix.sprog.update.SprogVersionQueryTest
[INFO] Tests run: 1, Failures: 0, Errors: 0, Skipped: 0, Time elapsed: 0 s - in jmri.jmrix.sprog.update.SprogVersionQueryTest
[INFO] Running jmri.jmrix.sprog.update.SprogHexFileTest
[INFO] Tests run: 1, Failures: 0, Errors: 0, Skipped: 0, Time elapsed: 0.01 s - in jmri.jmrix.sprog.update.SprogHexFileTest
[INFO] Running jmri.jmrix.sprog.update.SprogVersionActionTest
[INFO] Tests run: 1, Failures: 0, Errors: 0, Skipped: 0, Time elapsed: 0.002 s - in jmri.jmrix.sprog.update.SprogVersionActionTest
[INFO] Running jmri.jmrix.sprog.update.SprogIIUpdateActionTest
[INFO] Tests run: 1, Failures: 0, Errors: 0, Skipped: 0, Time elapsed: 0.002 s - in jmri.jmrix.sprog.update.SprogIIUpdateActionTest
[INFO] Running jmri.jmrix.sprog.update.SprogIIUpdateFrameTest
[INFO] Tests run: 2, Failures: 0, Errors: 0, Skipped: 0, Time elapsed: 0.074 s - in jmri.jmrix.sprog.update.SprogIIUpdateFrameTest
[INFO] Running jmri.jmrix.sprog.SprogSlotTest
[INFO] Tests run: 1, Failures: 0, Errors: 0, Skipped: 0, Time elapsed: 0 s - in jmri.jmrix.sprog.SprogSlotTest
[INFO] Running jmri.jmrix.sprog.SprogConnectionTypeListTest
[INFO] Tests run: 3, Failures: 0, Errors: 0, Skipped: 0, Time elapsed: 0.001 s - in jmri.jmrix.sprog.SprogConnectionTypeListTest
[INFO] Running jmri.jmrix.sprog.SprogThrottleManagerTest
[INFO] Tests run: 17, Failures: 0, Errors: 0, Skipped: 0, Time elapsed: 0.024 s - in jmri.jmrix.sprog.SprogThrottleManagerTest
[INFO] Running jmri.jmrix.sprog.SprogProgrammerManagerTest
[INFO] Tests run: 2, Failures: 0, Errors: 0, Skipped: 0, Time elapsed: 0.002 s - in jmri.jmrix.sprog.SprogProgrammerManagerTest
[INFO] Running jmri.jmrix.sprog.SprogCSTurnoutTest
[INFO] Tests run: 16, Failures: 0, Errors: 0, Skipped: 0, Time elapsed: 0.025 s - in jmri.jmrix.sprog.SprogCSTurnoutTest
[INFO] Running jmri.jmrix.sprog.SprogCSThrottleManagerTest
[INFO] Tests run: 1, Failures: 0, Errors: 0, Skipped: 0, Time elapsed: 0 s - in jmri.jmrix.sprog.SprogCSThrottleManagerTest
[INFO] Running jmri.jmrix.sprog.sprognano.ConnectionConfigTest
[WARNING] Tests run: 8, Failures: 0, Errors: 0, Skipped: 5, Time elapsed: 0.038 s - in jmri.jmrix.sprog.sprognano.ConnectionConfigTest
[INFO] Running jmri.jmrix.sprog.sprognano.configurexml.ConnectionConfigXmlTest
[INFO] Tests run: 4, Failures: 0, Errors: 0, Skipped: 0, Time elapsed: 0.038 s - in jmri.jmrix.sprog.sprognano.configurexml.ConnectionConfigXmlTest
[INFO] Running jmri.jmrix.sprog.sprognano.BundleTest
[INFO] Tests run: 2, Failures: 0, Errors: 0, Skipped: 0, Time elapsed: 0 s - in jmri.jmrix.sprog.sprognano.BundleTest
[INFO] Running jmri.jmrix.sprog.sprognano.SprogNanoSerialDriverAdapterTest
[INFO] Tests run: 1, Failures: 0, Errors: 0, Skipped: 0, Time elapsed: 0 s - in jmri.jmrix.sprog.sprognano.SprogNanoSerialDriverAdapterTest
[INFO] Running jmri.jmrix.sprog.packetgen.SprogPacketGenFrameTest
[INFO] Tests run: 2, Failures: 0, Errors: 0, Skipped: 0, Time elapsed: 0.057 s - in jmri.jmrix.sprog.packetgen.SprogPacketGenFrameTest
[INFO] Running jmri.jmrix.sprog.packetgen.BundleTest
[INFO] Tests run: 2, Failures: 0, Errors: 0, Skipped: 0, Time elapsed: 0 s - in jmri.jmrix.sprog.packetgen.BundleTest
[INFO] Running jmri.jmrix.sprog.packetgen.SprogPacketGenActionTest
[INFO] Tests run: 1, Failures: 0, Errors: 0, Skipped: 0, Time elapsed: 0 s - in jmri.jmrix.sprog.packetgen.SprogPacketGenActionTest
[INFO] Running jmri.jmrix.sprog.SprogTurnoutTest
[INFO] Tests run: 16, Failures: 0, Errors: 0, Skipped: 0, Time elapsed: 0.034 s - in jmri.jmrix.sprog.SprogTurnoutTest
[INFO] Running jmri.jmrix.sprog.SprogCSStreamConnectionConfigTest
[WARNING] Tests run: 8, Failures: 0, Errors: 0, Skipped: 5, Time elapsed: 0.013 s - in jmri.jmrix.sprog.SprogCSStreamConnectionConfigTest
[INFO] Running jmri.jmrix.sprog.SprogThrottleTest
[INFO] Tests run: 151, Failures: 0, Errors: 0, Skipped: 0, Time elapsed: 0.196 s - in jmri.jmrix.sprog.SprogThrottleTest
[INFO] Running jmri.jmrix.sprog.sprogCS.ConnectionConfigTest
[WARNING] Tests run: 8, Failures: 0, Errors: 0, Skipped: 5, Time elapsed: 0.038 s - in jmri.jmrix.sprog.sprogCS.ConnectionConfigTest
[INFO] Running jmri.jmrix.sprog.sprogCS.configurexml.ConnectionConfigXmlTest
[INFO] Tests run: 4, Failures: 0, Errors: 0, Skipped: 0, Time elapsed: 0.032 s - in jmri.jmrix.sprog.sprogCS.configurexml.ConnectionConfigXmlTest
[INFO] Running jmri.jmrix.sprog.sprogCS.BundleTest
[INFO] Tests run: 2, Failures: 0, Errors: 0, Skipped: 0, Time elapsed: 0 s - in jmri.jmrix.sprog.sprogCS.BundleTest
[INFO] Running jmri.jmrix.sprog.sprogCS.SprogCSSerialDriverAdapterTest
[INFO] Tests run: 1, Failures: 0, Errors: 0, Skipped: 0, Time elapsed: 0 s - in jmri.jmrix.sprog.sprogCS.SprogCSSerialDriverAdapterTest
[INFO] Running jmri.jmrix.sprog.sprogslotmon.SprogSlotMonFrameTest
[INFO] Tests run: 2, Failures: 0, Errors: 0, Skipped: 0, Time elapsed: 0.121 s - in jmri.jmrix.sprog.sprogslotmon.SprogSlotMonFrameTest
[INFO] Running jmri.jmrix.sprog.sprogslotmon.BundleTest
[INFO] Tests run: 2, Failures: 0, Errors: 0, Skipped: 0, Time elapsed: 0 s - in jmri.jmrix.sprog.sprogslotmon.BundleTest
[INFO] Running jmri.jmrix.sprog.sprogslotmon.SprogSlotMonActionTest
[INFO] Tests run: 1, Failures: 0, Errors: 0, Skipped: 0, Time elapsed: 0 s - in jmri.jmrix.sprog.sprogslotmon.SprogSlotMonActionTest
[INFO] Running jmri.jmrix.sprog.sprogslotmon.SprogSlotMonDataModelTest
[INFO] Tests run: 1, Failures: 0, Errors: 0, Skipped: 0, Time elapsed: 0 s - in jmri.jmrix.sprog.sprogslotmon.SprogSlotMonDataModelTest
[INFO] Running jmri.jmrix.sprog.SPROGCSMenuTest
[INFO] Tests run: 1, Failures: 0, Errors: 0, Skipped: 0, Time elapsed: 0.002 s - in jmri.jmrix.sprog.SPROGCSMenuTest
[INFO] Running jmri.jmrix.sprog.SprogPortControllerTest
[INFO] Tests run: 1, Failures: 0, Errors: 0, Skipped: 0, Time elapsed: 0.001 s - in jmri.jmrix.sprog.SprogPortControllerTest
[INFO] Running jmri.jmrix.sprog.pi.pisprognano.ConnectionConfigTest
[WARNING] Tests run: 8, Failures: 0, Errors: 0, Skipped: 5, Time elapsed: 0.039 s - in jmri.jmrix.sprog.pi.pisprognano.ConnectionConfigTest
[INFO] Running jmri.jmrix.sprog.pi.pisprognano.configurexml.ConnectionConfigXmlTest
[INFO] Tests run: 4, Failures: 0, Errors: 0, Skipped: 0, Time elapsed: 0.026 s - in jmri.jmrix.sprog.pi.pisprognano.configurexml.ConnectionConfigXmlTest
[INFO] Running jmri.jmrix.sprog.pi.pisprognano.BundleTest
[INFO] Tests run: 2, Failures: 0, Errors: 0, Skipped: 0, Time elapsed: 0 s - in jmri.jmrix.sprog.pi.pisprognano.BundleTest
[INFO] Running jmri.jmrix.sprog.pi.pisprognano.PiSprogNanoSerialDriverAdapterTest
[INFO] Tests run: 1, Failures: 0, Errors: 0, Skipped: 0, Time elapsed: 0 s - in jmri.jmrix.sprog.pi.pisprognano.PiSprogNanoSerialDriverAdapterTest
[INFO] Running jmri.jmrix.sprog.pi.pisprogone.ConnectionConfigTest
[WARNING] Tests run: 8, Failures: 0, Errors: 0, Skipped: 5, Time elapsed: 0.032 s - in jmri.jmrix.sprog.pi.pisprogone.ConnectionConfigTest
[INFO] Running jmri.jmrix.sprog.pi.pisprogone.configurexml.ConnectionConfigXmlTest
[INFO] Tests run: 4, Failures: 0, Errors: 0, Skipped: 0, Time elapsed: 0.031 s - in jmri.jmrix.sprog.pi.pisprogone.configurexml.ConnectionConfigXmlTest
[INFO] Running jmri.jmrix.sprog.pi.pisprogone.BundleTest
[INFO] Tests run: 2, Failures: 0, Errors: 0, Skipped: 0, Time elapsed: 0 s - in jmri.jmrix.sprog.pi.pisprogone.BundleTest
[INFO] Running jmri.jmrix.sprog.pi.pisprogone.PiSprogOneSerialDriverAdapterTest
[INFO] Tests run: 1, Failures: 0, Errors: 0, Skipped: 0, Time elapsed: 0 s - in jmri.jmrix.sprog.pi.pisprogone.PiSprogOneSerialDriverAdapterTest
[INFO] Running jmri.jmrix.sprog.pi.BundleTest
[INFO] Tests run: 2, Failures: 0, Errors: 0, Skipped: 0, Time elapsed: 0 s - in jmri.jmrix.sprog.pi.BundleTest
[INFO] Running jmri.jmrix.sprog.pi.pisprogonecs.ConnectionConfigTest
[WARNING] Tests run: 8, Failures: 0, Errors: 0, Skipped: 5, Time elapsed: 0.022 s - in jmri.jmrix.sprog.pi.pisprogonecs.ConnectionConfigTest
[INFO] Running jmri.jmrix.sprog.pi.pisprogonecs.configurexml.ConnectionConfigXmlTest
[INFO] Tests run: 4, Failures: 0, Errors: 0, Skipped: 0, Time elapsed: 0.03 s - in jmri.jmrix.sprog.pi.pisprogonecs.configurexml.ConnectionConfigXmlTest
[INFO] Running jmri.jmrix.sprog.pi.pisprogonecs.PiSprogOneCSSerialDriverAdapterTest
[INFO] Tests run: 1, Failures: 0, Errors: 0, Skipped: 0, Time elapsed: 0.003 s - in jmri.jmrix.sprog.pi.pisprogonecs.PiSprogOneCSSerialDriverAdapterTest
[INFO] Running jmri.jmrix.sprog.pi.pisprogonecs.BundleTest
[INFO] Tests run: 2, Failures: 0, Errors: 0, Skipped: 0, Time elapsed: 0 s - in jmri.jmrix.sprog.pi.pisprogonecs.BundleTest
[INFO] Running jmri.jmrix.sprog.SprogReplyTest
[INFO] Tests run: 3, Failures: 0, Errors: 0, Skipped: 0, Time elapsed: 0 s - in jmri.jmrix.sprog.SprogReplyTest
[INFO] Running jmri.jmrix.sprog.SprogCSStreamPortControllerTest
[INFO] Tests run: 2, Failures: 0, Errors: 0, Skipped: 0, Time elapsed: 0 s - in jmri.jmrix.sprog.SprogCSStreamPortControllerTest
[INFO] Running jmri.jmrix.sprog.SprogProgrammerTest
[INFO] Tests run: 12, Failures: 0, Errors: 0, Skipped: 0, Time elapsed: 0.015 s - in jmri.jmrix.sprog.SprogProgrammerTest
[INFO] Running jmri.jmrix.sprog.SprogConstantsTest
[INFO] Tests run: 1, Failures: 0, Errors: 0, Skipped: 0, Time elapsed: 0 s - in jmri.jmrix.sprog.SprogConstantsTest
[INFO] Running jmri.jmrix.sprog.SPROGMenuTest
[INFO] Tests run: 1, Failures: 0, Errors: 0, Skipped: 0, Time elapsed: 0 s - in jmri.jmrix.sprog.SPROGMenuTest
[INFO] Running jmri.jmrix.sprog.SprogSystemConnectionMemoTest
[INFO] Tests run: 13, Failures: 0, Errors: 0, Skipped: 0, Time elapsed: 0.013 s - in jmri.jmrix.sprog.SprogSystemConnectionMemoTest
[INFO] Running jmri.jmrix.sprog.sprogmon.BundleTest
[INFO] Tests run: 2, Failures: 0, Errors: 0, Skipped: 0, Time elapsed: 0 s - in jmri.jmrix.sprog.sprogmon.BundleTest
[INFO] Running jmri.jmrix.sprog.sprogmon.SprogMonActionTest
[INFO] Tests run: 1, Failures: 0, Errors: 0, Skipped: 0, Time elapsed: 0 s - in jmri.jmrix.sprog.sprogmon.SprogMonActionTest
[INFO] Running jmri.jmrix.sprog.sprogmon.SprogMonFrameTest
[INFO] Tests run: 2, Failures: 0, Errors: 0, Skipped: 0, Time elapsed: 0.127 s - in jmri.jmrix.sprog.sprogmon.SprogMonFrameTest
[INFO] Running jmri.jmrix.sprog.simulator.ConnectionConfigTest
[WARNING] Tests run: 8, Failures: 0, Errors: 0, Skipped: 5, Time elapsed: 0.014 s - in jmri.jmrix.sprog.simulator.ConnectionConfigTest
[INFO] Running jmri.jmrix.sprog.simulator.configurexml.ConnectionConfigXmlTest
[INFO] Tests run: 4, Failures: 0, Errors: 0, Skipped: 0, Time elapsed: 0.009 s - in jmri.jmrix.sprog.simulator.configurexml.ConnectionConfigXmlTest
[INFO] Running jmri.jmrix.sprog.simulator.BundleTest
[INFO] Tests run: 2, Failures: 0, Errors: 0, Skipped: 0, Time elapsed: 0 s - in jmri.jmrix.sprog.simulator.BundleTest
[INFO] Running jmri.jmrix.sprog.simulator.SimulatorAdapterTest
[INFO] Tests run: 1, Failures: 0, Errors: 0, Skipped: 0, Time elapsed: 0 s - in jmri.jmrix.sprog.simulator.SimulatorAdapterTest
[INFO] Running jmri.jmrix.jmriclient.configurexml.JMRIClientTurnoutManagerXmlTest
[INFO] Tests run: 1, Failures: 0, Errors: 0, Skipped: 0, Time elapsed: 0 s - in jmri.jmrix.jmriclient.configurexml.JMRIClientTurnoutManagerXmlTest
[INFO] Running jmri.jmrix.jmriclient.configurexml.JMRIClientReporterManagerXmlTest
[INFO] Tests run: 1, Failures: 0, Errors: 0, Skipped: 0, Time elapsed: 0 s - in jmri.jmrix.jmriclient.configurexml.JMRIClientReporterManagerXmlTest
[INFO] Running jmri.jmrix.jmriclient.configurexml.JMRIClientSensorManagerXmlTest
[INFO] Tests run: 1, Failures: 0, Errors: 0, Skipped: 0, Time elapsed: 0 s - in jmri.jmrix.jmriclient.configurexml.JMRIClientSensorManagerXmlTest
[INFO] Running jmri.jmrix.jmriclient.configurexml.JMRIClientLightManagerXmlTest
[INFO] Tests run: 1, Failures: 0, Errors: 0, Skipped: 0, Time elapsed: 0 s - in jmri.jmrix.jmriclient.configurexml.JMRIClientLightManagerXmlTest
[INFO] Running jmri.jmrix.jmriclient.swing.BundleTest
[INFO] Tests run: 6, Failures: 0, Errors: 0, Skipped: 0, Time elapsed: 0.008 s - in jmri.jmrix.jmriclient.swing.BundleTest
[INFO] Running jmri.jmrix.jmriclient.swing.mon.BundleTest
[INFO] Tests run: 6, Failures: 0, Errors: 0, Skipped: 0, Time elapsed: 0.001 s - in jmri.jmrix.jmriclient.swing.mon.BundleTest
[INFO] Running jmri.jmrix.jmriclient.swing.mon.JMRIClientMonPaneTest
[INFO] Tests run: 14, Failures: 0, Errors: 0, Skipped: 0, Time elapsed: 1.824 s - in jmri.jmrix.jmriclient.swing.mon.JMRIClientMonPaneTest
[INFO] Running jmri.jmrix.jmriclient.swing.mon.JMRIClientMonActionTest
[INFO] Tests run: 1, Failures: 0, Errors: 0, Skipped: 0, Time elapsed: 0.001 s - in jmri.jmrix.jmriclient.swing.mon.JMRIClientMonActionTest
[INFO] Running jmri.jmrix.jmriclient.swing.packetgen.BundleTest
[INFO] Tests run: 6, Failures: 0, Errors: 0, Skipped: 0, Time elapsed: 0.001 s - in jmri.jmrix.jmriclient.swing.packetgen.BundleTest
[INFO] Running jmri.jmrix.jmriclient.swing.packetgen.PacketGenActionTest
[INFO] Tests run: 2, Failures: 0, Errors: 0, Skipped: 0, Time elapsed: 0 s - in jmri.jmrix.jmriclient.swing.packetgen.PacketGenActionTest
[INFO] Running jmri.jmrix.jmriclient.swing.packetgen.PacketGenFrameTest
[INFO] Tests run: 2, Failures: 0, Errors: 0, Skipped: 0, Time elapsed: 0.046 s - in jmri.jmrix.jmriclient.swing.packetgen.PacketGenFrameTest
[INFO] Running jmri.jmrix.jmriclient.swing.JMRIClientMenuTest
[INFO] Tests run: 1, Failures: 0, Errors: 0, Skipped: 0, Time elapsed: 0 s - in jmri.jmrix.jmriclient.swing.JMRIClientMenuTest
[INFO] Running jmri.jmrix.jmriclient.swing.JMRIClientComponentFactoryTest
[INFO] Tests run: 1, Failures: 0, Errors: 0, Skipped: 0, Time elapsed: 0.001 s - in jmri.jmrix.jmriclient.swing.JMRIClientComponentFactoryTest
[INFO] Running jmri.jmrix.jmriclient.JMRIClientReporterTest
[INFO] Tests run: 4, Failures: 0, Errors: 0, Skipped: 0, Time elapsed: 0.002 s - in jmri.jmrix.jmriclient.JMRIClientReporterTest
[INFO] Running jmri.jmrix.jmriclient.JMRIClientTurnoutManagerTest
[WARNING] Tests run: 20, Failures: 0, Errors: 0, Skipped: 1, Time elapsed: 0.032 s - in jmri.jmrix.jmriclient.JMRIClientTurnoutManagerTest
[INFO] Running jmri.jmrix.jmriclient.BundleTest
[INFO] Tests run: 6, Failures: 0, Errors: 0, Skipped: 0, Time elapsed: 0 s - in jmri.jmrix.jmriclient.BundleTest
[INFO] Running jmri.jmrix.jmriclient.JMRIClientReplyTest
[INFO] Tests run: 3, Failures: 0, Errors: 0, Skipped: 0, Time elapsed: 0.001 s - in jmri.jmrix.jmriclient.JMRIClientReplyTest
[INFO] Running jmri.jmrix.jmriclient.JMRIClientConnectionTypeListTest
[INFO] Tests run: 1, Failures: 0, Errors: 0, Skipped: 0, Time elapsed: 0 s - in jmri.jmrix.jmriclient.JMRIClientConnectionTypeListTest
[INFO] Running jmri.jmrix.jmriclient.JMRIClientSensorTest
[INFO] Tests run: 14, Failures: 0, Errors: 0, Skipped: 0, Time elapsed: 0.131 s - in jmri.jmrix.jmriclient.JMRIClientSensorTest
[INFO] Running jmri.jmrix.jmriclient.JMRIClientLightTest
[INFO] Tests run: 1, Failures: 0, Errors: 0, Skipped: 0, Time elapsed: 0.001 s - in jmri.jmrix.jmriclient.JMRIClientLightTest
[INFO] Running jmri.jmrix.jmriclient.JMRIClientTrafficControllerTest
[INFO] Tests run: 6, Failures: 0, Errors: 0, Skipped: 0, Time elapsed: 0.002 s - in jmri.jmrix.jmriclient.JMRIClientTrafficControllerTest
[INFO] Running jmri.jmrix.jmriclient.JMRIClientLightManagerTest
[INFO] Tests run: 1, Failures: 0, Errors: 0, Skipped: 0, Time elapsed: 0.002 s - in jmri.jmrix.jmriclient.JMRIClientLightManagerTest
[INFO] Running jmri.jmrix.jmriclient.JMRIClientTurnoutTest
[INFO] Tests run: 16, Failures: 0, Errors: 0, Skipped: 0, Time elapsed: 0.032 s - in jmri.jmrix.jmriclient.JMRIClientTurnoutTest
[INFO] Running jmri.jmrix.jmriclient.JMRIClientPowerManagerTest
[INFO] Tests run: 12, Failures: 0, Errors: 0, Skipped: 0, Time elapsed: 0.014 s - in jmri.jmrix.jmriclient.JMRIClientPowerManagerTest
[INFO] Running jmri.jmrix.jmriclient.JMRIClientSensorManagerTest
[WARNING] Tests run: 22, Failures: 0, Errors: 0, Skipped: 1, Time elapsed: 0.024 s - in jmri.jmrix.jmriclient.JMRIClientSensorManagerTest
[INFO] Running jmri.jmrix.jmriclient.JMRIClientPortControllerTest
[INFO] Tests run: 1, Failures: 0, Errors: 0, Skipped: 0, Time elapsed: 0.001 s - in jmri.jmrix.jmriclient.JMRIClientPortControllerTest
[INFO] Running jmri.jmrix.jmriclient.JMRIClientSystemConnectionMemoTest
[INFO] Tests run: 14, Failures: 0, Errors: 0, Skipped: 0, Time elapsed: 0.015 s - in jmri.jmrix.jmriclient.JMRIClientSystemConnectionMemoTest
[INFO] Running jmri.jmrix.jmriclient.JMRIClientMessageTest
[INFO] Tests run: 3, Failures: 0, Errors: 0, Skipped: 0, Time elapsed: 0.001 s - in jmri.jmrix.jmriclient.JMRIClientMessageTest
[INFO] Running jmri.jmrix.jmriclient.JMRIClientReporterManagerTest
[WARNING] Tests run: 21, Failures: 0, Errors: 0, Skipped: 1, Time elapsed: 0.019 s - in jmri.jmrix.jmriclient.JMRIClientReporterManagerTest
[INFO] Running jmri.jmrix.jmriclient.networkdriver.ConnectionConfigTest
[WARNING] Tests run: 8, Failures: 0, Errors: 0, Skipped: 5, Time elapsed: 0.02 s - in jmri.jmrix.jmriclient.networkdriver.ConnectionConfigTest
[INFO] Running jmri.jmrix.jmriclient.networkdriver.configurexml.ConnectionConfigXmlTest
[INFO] Tests run: 4, Failures: 0, Errors: 0, Skipped: 0, Time elapsed: 0.014 s - in jmri.jmrix.jmriclient.networkdriver.configurexml.ConnectionConfigXmlTest
[INFO] Running jmri.jmrix.jmriclient.networkdriver.NetworkDriverAdapterTest
[INFO] Tests run: 1, Failures: 0, Errors: 0, Skipped: 0, Time elapsed: 0 s - in jmri.jmrix.jmriclient.networkdriver.NetworkDriverAdapterTest
[INFO] Running jmri.jmrix.pricom.pockettester.DataSourceTest
[INFO] Tests run: 2, Failures: 0, Errors: 0, Skipped: 0, Time elapsed: 0.069 s - in jmri.jmrix.pricom.pockettester.DataSourceTest
[INFO] Running jmri.jmrix.pricom.pockettester.StatusActionTest
[INFO] Tests run: 1, Failures: 0, Errors: 0, Skipped: 0, Time elapsed: 0 s - in jmri.jmrix.pricom.pockettester.StatusActionTest
[INFO] Running jmri.jmrix.pricom.pockettester.BundleTest
[INFO] Tests run: 2, Failures: 0, Errors: 0, Skipped: 0, Time elapsed: 0 s - in jmri.jmrix.pricom.pockettester.BundleTest
[INFO] Running jmri.jmrix.pricom.pockettester.PacketDataModelTest
[INFO] Tests run: 5, Failures: 0, Errors: 0, Skipped: 0, Time elapsed: 0 s - in jmri.jmrix.pricom.pockettester.PacketDataModelTest
[INFO] Running jmri.jmrix.pricom.pockettester.MonitorFrameTest
[INFO] Tests run: 2, Failures: 0, Errors: 0, Skipped: 0, Time elapsed: 0.08 s - in jmri.jmrix.pricom.pockettester.MonitorFrameTest
[INFO] Running jmri.jmrix.pricom.pockettester.PacketTableActionTest
[INFO] Tests run: 1, Failures: 0, Errors: 0, Skipped: 0, Time elapsed: 0 s - in jmri.jmrix.pricom.pockettester.PacketTableActionTest
[INFO] Running jmri.jmrix.pricom.pockettester.PacketTableFrameTest
[INFO] Tests run: 2, Failures: 0, Errors: 0, Skipped: 0, Time elapsed: 0.034 s - in jmri.jmrix.pricom.pockettester.PacketTableFrameTest
[INFO] Running jmri.jmrix.pricom.pockettester.MonitorActionTest
[INFO] Tests run: 1, Failures: 0, Errors: 0, Skipped: 0, Time elapsed: 0 s - in jmri.jmrix.pricom.pockettester.MonitorActionTest
[INFO] Running jmri.jmrix.pricom.pockettester.DataSourceActionTest
[INFO] Tests run: 1, Failures: 0, Errors: 0, Skipped: 0, Time elapsed: 0 s - in jmri.jmrix.pricom.pockettester.DataSourceActionTest
[INFO] Running jmri.jmrix.pricom.pockettester.PocketTesterMenuTest
[INFO] Tests run: 1, Failures: 0, Errors: 0, Skipped: 0, Time elapsed: 0 s - in jmri.jmrix.pricom.pockettester.PocketTesterMenuTest
[INFO] Running jmri.jmrix.pricom.pockettester.StatusFrameTest
[INFO] Tests run: 3, Failures: 0, Errors: 0, Skipped: 0, Time elapsed: 0.097 s - in jmri.jmrix.pricom.pockettester.StatusFrameTest
[INFO] Running jmri.jmrix.pricom.BundleTest
[INFO] Tests run: 2, Failures: 0, Errors: 0, Skipped: 0, Time elapsed: 0 s - in jmri.jmrix.pricom.BundleTest
[INFO] Running jmri.jmrix.pricom.downloader.BundleTest
[INFO] Tests run: 2, Failures: 0, Errors: 0, Skipped: 0, Time elapsed: 0.002 s - in jmri.jmrix.pricom.downloader.BundleTest
[INFO] Running jmri.jmrix.pricom.downloader.LoaderFrameTest
[INFO] Tests run: 2, Failures: 0, Errors: 0, Skipped: 0, Time elapsed: 0.142 s - in jmri.jmrix.pricom.downloader.LoaderFrameTest
[INFO] Running jmri.jmrix.pricom.downloader.PdiFileTest
[INFO] Tests run: 2, Failures: 0, Errors: 0, Skipped: 0, Time elapsed: 0 s - in jmri.jmrix.pricom.downloader.PdiFileTest
[INFO] Running jmri.jmrix.pricom.downloader.LoaderPanelActionTest
[INFO] Tests run: 1, Failures: 0, Errors: 0, Skipped: 0, Time elapsed: 0 s - in jmri.jmrix.pricom.downloader.LoaderPanelActionTest
[INFO] Running jmri.jmrix.pricom.downloader.LoaderPaneTest
[INFO] Tests run: 4, Failures: 0, Errors: 0, Skipped: 0, Time elapsed: 0.052 s - in jmri.jmrix.pricom.downloader.LoaderPaneTest
[INFO] Running jmri.jmrix.pricom.PricomMenuTest
[INFO] Tests run: 1, Failures: 0, Errors: 0, Skipped: 0, Time elapsed: 0 s - in jmri.jmrix.pricom.PricomMenuTest
[INFO] Running jmri.jmrix.jinput.TreeModelTest
[INFO] Tests run: 1, Failures: 0, Errors: 0, Skipped: 0, Time elapsed: 0.016 s - in jmri.jmrix.jinput.TreeModelTest
[INFO] Running jmri.jmrix.jinput.UsbNodeTest
[INFO] Tests run: 1, Failures: 0, Errors: 0, Skipped: 0, Time elapsed: 0.001 s - in jmri.jmrix.jinput.UsbNodeTest
[INFO] Running jmri.jmrix.jinput.treecontrol.TreeActionTest
[INFO] Tests run: 1, Failures: 0, Errors: 0, Skipped: 0, Time elapsed: 0 s - in jmri.jmrix.jinput.treecontrol.TreeActionTest
[INFO] Running jmri.jmrix.jinput.treecontrol.TreeFrameTest
[INFO] Tests run: 2, Failures: 0, Errors: 0, Skipped: 0, Time elapsed: 0.107 s - in jmri.jmrix.jinput.treecontrol.TreeFrameTest
[INFO] Running jmri.jmrix.jinput.treecontrol.TreePanelTest
[INFO] Tests run: 1, Failures: 0, Errors: 0, Skipped: 0, Time elapsed: 0.004 s - in jmri.jmrix.jinput.treecontrol.TreePanelTest
[INFO] Running jmri.jmrix.dcc4pc.Dcc4PcSensorManagerTest
[WARNING] Tests run: 23, Failures: 0, Errors: 0, Skipped: 2, Time elapsed: 18.346 s - in jmri.jmrix.dcc4pc.Dcc4PcSensorManagerTest
[INFO] Running jmri.jmrix.dcc4pc.configurexml.Dcc4PcReporterManagerXmlTest
[INFO] Tests run: 1, Failures: 0, Errors: 0, Skipped: 0, Time elapsed: 0 s - in jmri.jmrix.dcc4pc.configurexml.Dcc4PcReporterManagerXmlTest
[INFO] Running jmri.jmrix.dcc4pc.configurexml.Dcc4PcSensorManagerXmlTest
[INFO] Tests run: 1, Failures: 0, Errors: 0, Skipped: 0, Time elapsed: 0 s - in jmri.jmrix.dcc4pc.configurexml.Dcc4PcSensorManagerXmlTest
[INFO] Running jmri.jmrix.dcc4pc.Dcc4PcPortControllerTest
[INFO] Tests run: 1, Failures: 0, Errors: 0, Skipped: 0, Time elapsed: 0.001 s - in jmri.jmrix.dcc4pc.Dcc4PcPortControllerTest
[INFO] Running jmri.jmrix.dcc4pc.serialdriver.ConnectionConfigTest
[WARNING] Tests run: 8, Failures: 0, Errors: 0, Skipped: 5, Time elapsed: 0.048 s - in jmri.jmrix.dcc4pc.serialdriver.ConnectionConfigTest
[INFO] Running jmri.jmrix.dcc4pc.serialdriver.configurexml.ConnectionConfigXmlTest
[INFO] Tests run: 4, Failures: 0, Errors: 0, Skipped: 0, Time elapsed: 0.033 s - in jmri.jmrix.dcc4pc.serialdriver.configurexml.ConnectionConfigXmlTest
[INFO] Running jmri.jmrix.dcc4pc.serialdriver.SerialDriverAdapterTest
[INFO] Tests run: 1, Failures: 0, Errors: 0, Skipped: 0, Time elapsed: 0.001 s - in jmri.jmrix.dcc4pc.serialdriver.SerialDriverAdapterTest
[INFO] Running jmri.jmrix.dcc4pc.swing.Dcc4PcMenuTest
[INFO] Tests run: 1, Failures: 0, Errors: 0, Skipped: 0, Time elapsed: 0.009 s - in jmri.jmrix.dcc4pc.swing.Dcc4PcMenuTest
[INFO] Running jmri.jmrix.dcc4pc.swing.Dcc4PcComponentFactoryTest
[INFO] Tests run: 3, Failures: 0, Errors: 0, Skipped: 0, Time elapsed: 0.008 s - in jmri.jmrix.dcc4pc.swing.Dcc4PcComponentFactoryTest
[INFO] Running jmri.jmrix.dcc4pc.swing.StatusPanelTest
[INFO] Tests run: 1, Failures: 0, Errors: 0, Skipped: 0, Time elapsed: 0.003 s - in jmri.jmrix.dcc4pc.swing.StatusPanelTest
[INFO] Running jmri.jmrix.dcc4pc.swing.packetgen.PacketGenPanelTest
[INFO] Tests run: 4, Failures: 0, Errors: 0, Skipped: 0, Time elapsed: 0.005 s - in jmri.jmrix.dcc4pc.swing.packetgen.PacketGenPanelTest
[INFO] Running jmri.jmrix.dcc4pc.swing.boardlists.BoardListPanelTest
[INFO] Tests run: 2, Failures: 0, Errors: 0, Skipped: 0, Time elapsed: 0.019 s - in jmri.jmrix.dcc4pc.swing.boardlists.BoardListPanelTest
[INFO] Running jmri.jmrix.dcc4pc.swing.monitor.Dcc4PcMonPaneTest
[INFO] Tests run: 13, Failures: 0, Errors: 0, Skipped: 0, Time elapsed: 0.968 s - in jmri.jmrix.dcc4pc.swing.monitor.Dcc4PcMonPaneTest
[INFO] Running jmri.jmrix.dcc4pc.swing.Dcc4PcNamedPaneActionTest
[INFO] Tests run: 1, Failures: 0, Errors: 0, Skipped: 0, Time elapsed: 0.014 s - in jmri.jmrix.dcc4pc.swing.Dcc4PcNamedPaneActionTest
[INFO] Running jmri.jmrix.dcc4pc.Dcc4PcReplyTest
[INFO] Tests run: 3, Failures: 0, Errors: 0, Skipped: 0, Time elapsed: 0 s - in jmri.jmrix.dcc4pc.Dcc4PcReplyTest
[INFO] Running jmri.jmrix.dcc4pc.BundleTest
[INFO] Tests run: 2, Failures: 0, Errors: 0, Skipped: 0, Time elapsed: 0 s - in jmri.jmrix.dcc4pc.BundleTest
[INFO] Running jmri.jmrix.dcc4pc.Dcc4PcSensorTest
[INFO] Tests run: 14, Failures: 0, Errors: 0, Skipped: 0, Time elapsed: 0.124 s - in jmri.jmrix.dcc4pc.Dcc4PcSensorTest
[INFO] Running jmri.jmrix.dcc4pc.Dcc4PcSystemConnectionMemoTest
[INFO] Tests run: 10, Failures: 0, Errors: 0, Skipped: 0, Time elapsed: 0.021 s - in jmri.jmrix.dcc4pc.Dcc4PcSystemConnectionMemoTest
[INFO] Running jmri.jmrix.dcc4pc.Dcc4PcReporterManagerTest
[WARNING] Tests run: 21, Failures: 0, Errors: 0, Skipped: 1, Time elapsed: 0.057 s - in jmri.jmrix.dcc4pc.Dcc4PcReporterManagerTest
[INFO] Running jmri.jmrix.dcc4pc.Dcc4PcReporterTest
[INFO] Tests run: 5, Failures: 0, Errors: 0, Skipped: 0, Time elapsed: 0.015 s - in jmri.jmrix.dcc4pc.Dcc4PcReporterTest
[INFO] Running jmri.jmrix.dcc4pc.Dcc4PcProgrammerManagerTest
[INFO] Tests run: 1, Failures: 0, Errors: 0, Skipped: 0, Time elapsed: 0 s - in jmri.jmrix.dcc4pc.Dcc4PcProgrammerManagerTest
[INFO] Running jmri.jmrix.dcc4pc.Dcc4PcMessageTest
[INFO] Tests run: 15, Failures: 0, Errors: 0, Skipped: 0, Time elapsed: 0.007 s - in jmri.jmrix.dcc4pc.Dcc4PcMessageTest
[INFO] Running jmri.jmrix.dcc4pc.Dcc4PcBoardManagerTest
[INFO] Tests run: 1, Failures: 0, Errors: 0, Skipped: 0, Time elapsed: 0.002 s - in jmri.jmrix.dcc4pc.Dcc4PcBoardManagerTest
[INFO] Running jmri.jmrix.dcc4pc.Dcc4PcOpsModeProgrammerTest
[INFO] Tests run: 14, Failures: 0, Errors: 0, Skipped: 0, Time elapsed: 0.067 s - in jmri.jmrix.dcc4pc.Dcc4PcOpsModeProgrammerTest
[INFO] Running jmri.jmrix.dcc4pc.Dcc4PcConnectionTypeListTest
[INFO] Tests run: 1, Failures: 0, Errors: 0, Skipped: 0, Time elapsed: 0 s - in jmri.jmrix.dcc4pc.Dcc4PcConnectionTypeListTest
[INFO] Running jmri.jmrix.dcc4pc.Dcc4PcTrafficControllerTest
[INFO] Tests run: 6, Failures: 0, Errors: 0, Skipped: 0, Time elapsed: 0.001 s - in jmri.jmrix.dcc4pc.Dcc4PcTrafficControllerTest
[INFO] Running jmri.jmrix.oaktree.SerialTurnoutTest
[WARNING] Tests run: 16, Failures: 0, Errors: 0, Skipped: 3, Time elapsed: 0.028 s - in jmri.jmrix.oaktree.SerialTurnoutTest
[INFO] Running jmri.jmrix.oaktree.configurexml.SerialLightManagerXmlTest
[INFO] Tests run: 1, Failures: 0, Errors: 0, Skipped: 0, Time elapsed: 0 s - in jmri.jmrix.oaktree.configurexml.SerialLightManagerXmlTest
[INFO] Running jmri.jmrix.oaktree.configurexml.SerialSensorManagerXmlTest
[INFO] Tests run: 1, Failures: 0, Errors: 0, Skipped: 0, Time elapsed: 0 s - in jmri.jmrix.oaktree.configurexml.SerialSensorManagerXmlTest
[INFO] Running jmri.jmrix.oaktree.configurexml.SerialTurnoutManagerXmlTest
[INFO] Tests run: 1, Failures: 0, Errors: 0, Skipped: 0, Time elapsed: 0 s - in jmri.jmrix.oaktree.configurexml.SerialTurnoutManagerXmlTest
[INFO] Running jmri.jmrix.oaktree.SerialAddressTest
[INFO] Tests run: 6, Failures: 0, Errors: 0, Skipped: 0, Time elapsed: 0.006 s - in jmri.jmrix.oaktree.SerialAddressTest
[INFO] Running jmri.jmrix.oaktree.serialdriver.ConnectionConfigTest
[WARNING] Tests run: 8, Failures: 0, Errors: 0, Skipped: 5, Time elapsed: 0.061 s - in jmri.jmrix.oaktree.serialdriver.ConnectionConfigTest
[INFO] Running jmri.jmrix.oaktree.serialdriver.configurexml.ConnectionConfigXmlTest
[INFO] Tests run: 4, Failures: 0, Errors: 0, Skipped: 0, Time elapsed: 0.039 s - in jmri.jmrix.oaktree.serialdriver.configurexml.ConnectionConfigXmlTest
[INFO] Running jmri.jmrix.oaktree.serialdriver.BundleTest
[INFO] Tests run: 2, Failures: 0, Errors: 0, Skipped: 0, Time elapsed: 0 s - in jmri.jmrix.oaktree.serialdriver.BundleTest
[INFO] Running jmri.jmrix.oaktree.serialdriver.SerialDriverAdapterTest
[INFO] Tests run: 1, Failures: 0, Errors: 0, Skipped: 0, Time elapsed: 0 s - in jmri.jmrix.oaktree.serialdriver.SerialDriverAdapterTest
[INFO] Running jmri.jmrix.oaktree.swing.OakTreeComponentFactoryTest
[INFO] Tests run: 1, Failures: 0, Errors: 0, Skipped: 0, Time elapsed: 0 s - in jmri.jmrix.oaktree.swing.OakTreeComponentFactoryTest
[INFO] Running jmri.jmrix.oaktree.SerialLightTest
[INFO] Tests run: 2, Failures: 0, Errors: 0, Skipped: 0, Time elapsed: 0 s - in jmri.jmrix.oaktree.SerialLightTest
[INFO] Running jmri.jmrix.oaktree.SerialTurnoutManagerTest
[WARNING] Tests run: 22, Failures: 0, Errors: 0, Skipped: 1, Time elapsed: 0.038 s - in jmri.jmrix.oaktree.SerialTurnoutManagerTest
[INFO] Running jmri.jmrix.oaktree.SerialReplyTest
[INFO] Tests run: 3, Failures: 0, Errors: 0, Skipped: 0, Time elapsed: 0.002 s - in jmri.jmrix.oaktree.SerialReplyTest
[INFO] Running jmri.jmrix.oaktree.BundleTest
[INFO] Tests run: 2, Failures: 0, Errors: 0, Skipped: 0, Time elapsed: 0 s - in jmri.jmrix.oaktree.BundleTest
[INFO] Running jmri.jmrix.oaktree.serialmon.SerialMonActionTest
[INFO] Tests run: 2, Failures: 0, Errors: 0, Skipped: 0, Time elapsed: 0.002 s - in jmri.jmrix.oaktree.serialmon.SerialMonActionTest
[INFO] Running jmri.jmrix.oaktree.serialmon.BundleTest
[INFO] Tests run: 2, Failures: 0, Errors: 0, Skipped: 0, Time elapsed: 0 s - in jmri.jmrix.oaktree.serialmon.BundleTest
[INFO] Running jmri.jmrix.oaktree.serialmon.SerialMonFrameTest
[INFO] Tests run: 1, Failures: 0, Errors: 0, Skipped: 0, Time elapsed: 0.021 s - in jmri.jmrix.oaktree.serialmon.SerialMonFrameTest
[INFO] Running jmri.jmrix.oaktree.packetgen.BundleTest
[INFO] Tests run: 2, Failures: 0, Errors: 0, Skipped: 0, Time elapsed: 0 s - in jmri.jmrix.oaktree.packetgen.BundleTest
[INFO] Running jmri.jmrix.oaktree.packetgen.SerialPacketGenActionTest
[INFO] Tests run: 2, Failures: 0, Errors: 0, Skipped: 0, Time elapsed: 0 s - in jmri.jmrix.oaktree.packetgen.SerialPacketGenActionTest
[INFO] Running jmri.jmrix.oaktree.packetgen.SerialPacketGenFrameTest
[INFO] Tests run: 1, Failures: 0, Errors: 0, Skipped: 0, Time elapsed: 0.002 s - in jmri.jmrix.oaktree.packetgen.SerialPacketGenFrameTest
[INFO] Running jmri.jmrix.oaktree.SerialNodeTest
[INFO] Tests run: 6, Failures: 0, Errors: 0, Skipped: 0, Time elapsed: 0.008 s - in jmri.jmrix.oaktree.SerialNodeTest
[INFO] Running jmri.jmrix.oaktree.OakTreeSystemConnectionMemoTest
[INFO] Tests run: 10, Failures: 0, Errors: 0, Skipped: 0, Time elapsed: 0.03 s - in jmri.jmrix.oaktree.OakTreeSystemConnectionMemoTest
[INFO] Running jmri.jmrix.oaktree.OakTreeMenuTest
[INFO] Tests run: 1, Failures: 0, Errors: 0, Skipped: 0, Time elapsed: 0.001 s - in jmri.jmrix.oaktree.OakTreeMenuTest
[INFO] Running jmri.jmrix.oaktree.SerialPortControllerTest
[INFO] Tests run: 1, Failures: 0, Errors: 0, Skipped: 0, Time elapsed: 0 s - in jmri.jmrix.oaktree.SerialPortControllerTest
[INFO] Running jmri.jmrix.oaktree.SerialSensorManagerTest
[WARNING] Tests run: 22, Failures: 0, Errors: 0, Skipped: 1, Time elapsed: 0.026 s - in jmri.jmrix.oaktree.SerialSensorManagerTest
[INFO] Running jmri.jmrix.oaktree.SerialLightManagerTest
[INFO] Tests run: 2, Failures: 0, Errors: 0, Skipped: 0, Time elapsed: 0 s - in jmri.jmrix.oaktree.SerialLightManagerTest
[INFO] Running jmri.jmrix.oaktree.SerialTrafficControllerTest
[INFO] Tests run: 9, Failures: 0, Errors: 0, Skipped: 0, Time elapsed: 0.006 s - in jmri.jmrix.oaktree.SerialTrafficControllerTest
[INFO] Running jmri.jmrix.oaktree.SerialConnectionTypeListTest
[INFO] Tests run: 1, Failures: 0, Errors: 0, Skipped: 0, Time elapsed: 0 s - in jmri.jmrix.oaktree.SerialConnectionTypeListTest
[INFO] Running jmri.jmrix.oaktree.SerialMessageTest
[INFO] Tests run: 3, Failures: 0, Errors: 0, Skipped: 0, Time elapsed: 0 s - in jmri.jmrix.oaktree.SerialMessageTest
[INFO] Running jmri.jmrix.oaktree.nodeconfig.BundleTest
[INFO] Tests run: 2, Failures: 0, Errors: 0, Skipped: 0, Time elapsed: 0 s - in jmri.jmrix.oaktree.nodeconfig.BundleTest
[INFO] Running jmri.jmrix.oaktree.nodeconfig.NodeConfigActionTest
[INFO] Tests run: 2, Failures: 0, Errors: 0, Skipped: 0, Time elapsed: 0 s - in jmri.jmrix.oaktree.nodeconfig.NodeConfigActionTest
[INFO] Running jmri.jmrix.oaktree.nodeconfig.NodeConfigFrameTest
[INFO] Tests run: 3, Failures: 0, Errors: 0, Skipped: 0, Time elapsed: 0.13 s - in jmri.jmrix.oaktree.nodeconfig.NodeConfigFrameTest
[INFO] Running jmri.jmrix.oaktree.SerialSensorTest
[INFO] Tests run: 15, Failures: 0, Errors: 0, Skipped: 0, Time elapsed: 0.127 s - in jmri.jmrix.oaktree.SerialSensorTest
[INFO] Running jmri.jmrix.oaktree.simulator.ConnectionConfigTest
[WARNING] Tests run: 8, Failures: 0, Errors: 0, Skipped: 5, Time elapsed: 0.018 s - in jmri.jmrix.oaktree.simulator.ConnectionConfigTest
[INFO] Running jmri.jmrix.oaktree.simulator.configurexml.ConnectionConfigXmlTest
[INFO] Tests run: 4, Failures: 0, Errors: 0, Skipped: 0, Time elapsed: 0.014 s - in jmri.jmrix.oaktree.simulator.configurexml.ConnectionConfigXmlTest
[INFO] Running jmri.jmrix.oaktree.simulator.BundleTest
[INFO] Tests run: 2, Failures: 0, Errors: 0, Skipped: 0, Time elapsed: 0 s - in jmri.jmrix.oaktree.simulator.BundleTest
[INFO] Running jmri.jmrix.oaktree.simulator.SimulatorAdapterTest
[INFO] Tests run: 1, Failures: 0, Errors: 0, Skipped: 0, Time elapsed: 0 s - in jmri.jmrix.oaktree.simulator.SimulatorAdapterTest
[INFO] Running jmri.jmrix.rps.RpsSensorTest
[INFO] Tests run: 18, Failures: 0, Errors: 0, Skipped: 0, Time elapsed: 0.143 s - in jmri.jmrix.rps.RpsSensorTest
[INFO] Running jmri.jmrix.rps.configurexml.RpsSensorManagerXmlTest
[INFO] Tests run: 1, Failures: 0, Errors: 0, Skipped: 0, Time elapsed: 0 s - in jmri.jmrix.rps.configurexml.RpsSensorManagerXmlTest
[INFO] Running jmri.jmrix.rps.configurexml.RpsReporterManagerXmlTest
[INFO] Tests run: 1, Failures: 0, Errors: 0, Skipped: 0, Time elapsed: 0 s - in jmri.jmrix.rps.configurexml.RpsReporterManagerXmlTest
[INFO] Running jmri.jmrix.rps.Ash2_0AlgorithmTest
[INFO] Tests run: 7, Failures: 0, Errors: 0, Skipped: 0, Time elapsed: 0 s - in jmri.jmrix.rps.Ash2_0AlgorithmTest
[INFO] Running jmri.jmrix.rps.swing.CsvExportMeasurementActionTest
[INFO] Tests run: 1, Failures: 0, Errors: 0, Skipped: 0, Time elapsed: 0.004 s - in jmri.jmrix.rps.swing.CsvExportMeasurementActionTest
[INFO] Running jmri.jmrix.rps.swing.soundset.SoundSetActionTest
[INFO] Tests run: 2, Failures: 0, Errors: 0, Skipped: 0, Time elapsed: 0.002 s - in jmri.jmrix.rps.swing.soundset.SoundSetActionTest
[INFO] Running jmri.jmrix.rps.swing.soundset.SoundSetPaneTest
[INFO] Tests run: 1, Failures: 0, Errors: 0, Skipped: 0, Time elapsed: 0.005 s - in jmri.jmrix.rps.swing.soundset.SoundSetPaneTest
[INFO] Running jmri.jmrix.rps.swing.soundset.SoundSetFrameTest
[INFO] Tests run: 2, Failures: 0, Errors: 0, Skipped: 0, Time elapsed: 0.105 s - in jmri.jmrix.rps.swing.soundset.SoundSetFrameTest
[INFO] Running jmri.jmrix.rps.swing.polling.PollDataModelTest
[INFO] Tests run: 1, Failures: 0, Errors: 0, Skipped: 0, Time elapsed: 0.022 s - in jmri.jmrix.rps.swing.polling.PollDataModelTest
[INFO] Running jmri.jmrix.rps.swing.polling.PollTableActionTest
[INFO] Tests run: 1, Failures: 0, Errors: 0, Skipped: 0, Time elapsed: 0.081 s - in jmri.jmrix.rps.swing.polling.PollTableActionTest
[INFO] Running jmri.jmrix.rps.swing.polling.BundleTest
[INFO] Tests run: 6, Failures: 0, Errors: 0, Skipped: 0, Time elapsed: 0.009 s - in jmri.jmrix.rps.swing.polling.BundleTest
[INFO] Running jmri.jmrix.rps.swing.polling.PollTableFrameTest
[INFO] Tests run: 2, Failures: 0, Errors: 0, Skipped: 0, Time elapsed: 0.088 s - in jmri.jmrix.rps.swing.polling.PollTableFrameTest
[INFO] Running jmri.jmrix.rps.swing.polling.PollTablePaneTest
[INFO] Tests run: 1, Failures: 0, Errors: 0, Skipped: 0, Time elapsed: 0.01 s - in jmri.jmrix.rps.swing.polling.PollTablePaneTest
[INFO] Running jmri.jmrix.rps.swing.BundleTest
[INFO] Tests run: 6, Failures: 0, Errors: 0, Skipped: 0, Time elapsed: 0 s - in jmri.jmrix.rps.swing.BundleTest
[INFO] Running jmri.jmrix.rps.swing.CsvExportActionTest
[INFO] Tests run: 1, Failures: 0, Errors: 0, Skipped: 0, Time elapsed: 0.001 s - in jmri.jmrix.rps.swing.CsvExportActionTest
[INFO] Running jmri.jmrix.rps.swing.AffineEntryPanelTest
[INFO] Tests run: 3, Failures: 0, Errors: 0, Skipped: 0, Time elapsed: 0.035 s - in jmri.jmrix.rps.swing.AffineEntryPanelTest
[INFO] Running jmri.jmrix.rps.swing.RpsComponentFactoryTest
[INFO] Tests run: 1, Failures: 0, Errors: 0, Skipped: 0, Time elapsed: 0 s - in jmri.jmrix.rps.swing.RpsComponentFactoryTest
[INFO] Running jmri.jmrix.rps.swing.LoadStorePanelTest
[INFO] Tests run: 1, Failures: 0, Errors: 0, Skipped: 0, Time elapsed: 0.016 s - in jmri.jmrix.rps.swing.LoadStorePanelTest
[INFO] Running jmri.jmrix.rps.swing.debugger.DebuggerFrameTest
[INFO] Tests run: 2, Failures: 0, Errors: 0, Skipped: 0, Time elapsed: 0.149 s - in jmri.jmrix.rps.swing.debugger.DebuggerFrameTest
[INFO] Running jmri.jmrix.rps.swing.debugger.DebuggerActionTest
[INFO] Tests run: 1, Failures: 0, Errors: 0, Skipped: 0, Time elapsed: 0.001 s - in jmri.jmrix.rps.swing.debugger.DebuggerActionTest
[INFO] Running jmri.jmrix.rps.swing.debugger.DebuggerTimePaneTest
[INFO] Tests run: 1, Failures: 0, Errors: 0, Skipped: 0, Time elapsed: 0.007 s - in jmri.jmrix.rps.swing.debugger.DebuggerTimePaneTest
[INFO] Running jmri.jmrix.rps.swing.debugger.DebuggerTest
[INFO] Tests run: 1, Failures: 0, Errors: 0, Skipped: 0, Time elapsed: 0.08 s - in jmri.jmrix.rps.swing.debugger.DebuggerTest
[INFO] Running jmri.jmrix.rps.AlgorithmsTest
[INFO] Tests run: 1, Failures: 0, Errors: 0, Skipped: 0, Time elapsed: 0 s - in jmri.jmrix.rps.AlgorithmsTest
[INFO] Running jmri.jmrix.rps.Ash2_1AlgorithmTest
[INFO] Tests run: 7, Failures: 0, Errors: 0, Skipped: 0, Time elapsed: 0.01 s - in jmri.jmrix.rps.Ash2_1AlgorithmTest
[INFO] Running jmri.jmrix.rps.trackingpanel.RpsTrackingControlPaneTest
[INFO] Tests run: 1, Failures: 0, Errors: 0, Skipped: 0, Time elapsed: 0.005 s - in jmri.jmrix.rps.trackingpanel.RpsTrackingControlPaneTest
[INFO] Running jmri.jmrix.rps.trackingpanel.RpsTrackingPanelTest
[INFO] Tests run: 1, Failures: 0, Errors: 0, Skipped: 0, Time elapsed: 0.039 s - in jmri.jmrix.rps.trackingpanel.RpsTrackingPanelTest
[INFO] Running jmri.jmrix.rps.trackingpanel.RpsTrackingFrameActionTest
[INFO] Tests run: 1, Failures: 0, Errors: 0, Skipped: 0, Time elapsed: 0 s - in jmri.jmrix.rps.trackingpanel.RpsTrackingFrameActionTest
[INFO] Running jmri.jmrix.rps.trackingpanel.RpsTrackingFrameTest
[INFO] Tests run: 1, Failures: 0, Errors: 0, Skipped: 0, Time elapsed: 0.084 s - in jmri.jmrix.rps.trackingpanel.RpsTrackingFrameTest
[INFO] Running jmri.jmrix.rps.RpsConnectionTypeListTest
[INFO] Tests run: 1, Failures: 0, Errors: 0, Skipped: 0, Time elapsed: 0 s - in jmri.jmrix.rps.RpsConnectionTypeListTest
[INFO] Running jmri.jmrix.rps.BundleTest
[INFO] Tests run: 6, Failures: 0, Errors: 0, Skipped: 0, Time elapsed: 0 s - in jmri.jmrix.rps.BundleTest
[INFO] Running jmri.jmrix.rps.RpsBlockTest
[INFO] Tests run: 1, Failures: 0, Errors: 0, Skipped: 0, Time elapsed: 0 s - in jmri.jmrix.rps.RpsBlockTest
[INFO] Running jmri.jmrix.rps.RpsReporterTest
[INFO] Tests run: 4, Failures: 0, Errors: 0, Skipped: 0, Time elapsed: 0.001 s - in jmri.jmrix.rps.RpsReporterTest
[INFO] Running jmri.jmrix.rps.Analytic_AAlgorithmTest
[WARNING] Tests run: 7, Failures: 0, Errors: 0, Skipped: 4, Time elapsed: 0.005 s - in jmri.jmrix.rps.Analytic_AAlgorithmTest
[INFO] Running jmri.jmrix.rps.RpsMenuTest
[INFO] Tests run: 1, Failures: 0, Errors: 0, Skipped: 0, Time elapsed: 0.009 s - in jmri.jmrix.rps.RpsMenuTest
[INFO] Running jmri.jmrix.rps.DistributorTest
[INFO] Tests run: 1, Failures: 0, Errors: 0, Skipped: 0, Time elapsed: 0 s - in jmri.jmrix.rps.DistributorTest
[INFO] Running jmri.jmrix.rps.Ash1_0AlgorithmTest
[WARNING] Tests run: 4, Failures: 0, Errors: 0, Skipped: 1, Time elapsed: 0.007 s - in jmri.jmrix.rps.Ash1_0AlgorithmTest
[INFO] Running jmri.jmrix.rps.RpsSensorManagerTest
[WARNING] Tests run: 23, Failures: 0, Errors: 0, Skipped: 1, Time elapsed: 0.026 s - in jmri.jmrix.rps.RpsSensorManagerTest
[INFO] Running jmri.jmrix.rps.PositionFileTest
[INFO] Tests run: 4, Failures: 0, Errors: 0, Skipped: 0, Time elapsed: 0.005 s - in jmri.jmrix.rps.PositionFileTest
[INFO] Running jmri.jmrix.rps.ModelTest
[INFO] Tests run: 1, Failures: 0, Errors: 0, Skipped: 0, Time elapsed: 0.001 s - in jmri.jmrix.rps.ModelTest
[INFO] Running jmri.jmrix.rps.rpsmon.RpsMonFrameTest
[INFO] Tests run: 2, Failures: 0, Errors: 0, Skipped: 0, Time elapsed: 0.153 s - in jmri.jmrix.rps.rpsmon.RpsMonFrameTest
[INFO] Running jmri.jmrix.rps.rpsmon.RpsMonTest
[INFO] Tests run: 1, Failures: 0, Errors: 0, Skipped: 0, Time elapsed: 0.064 s - in jmri.jmrix.rps.rpsmon.RpsMonTest
[INFO] Running jmri.jmrix.rps.rpsmon.RpsMonActionTest
[INFO] Tests run: 1, Failures: 0, Errors: 0, Skipped: 0, Time elapsed: 0 s - in jmri.jmrix.rps.rpsmon.RpsMonActionTest
[INFO] Running jmri.jmrix.rps.reversealign.AlignmentPanelActionTest
[INFO] Tests run: 1, Failures: 0, Errors: 0, Skipped: 0, Time elapsed: 0 s - in jmri.jmrix.rps.reversealign.AlignmentPanelActionTest
[INFO] Running jmri.jmrix.rps.reversealign.AlignmentPanelTest
[INFO] Tests run: 1, Failures: 0, Errors: 0, Skipped: 0, Time elapsed: 0.137 s - in jmri.jmrix.rps.reversealign.AlignmentPanelTest
[INFO] Running jmri.jmrix.rps.ReadingTest
[INFO] Tests run: 5, Failures: 0, Errors: 0, Skipped: 0, Time elapsed: 0 s - in jmri.jmrix.rps.ReadingTest
[INFO] Running jmri.jmrix.rps.PollingFileTest
[INFO] Tests run: 1, Failures: 0, Errors: 0, Skipped: 0, Time elapsed: 0 s - in jmri.jmrix.rps.PollingFileTest
[INFO] Running jmri.jmrix.rps.serial.ConnectionConfigTest
[WARNING] Tests run: 8, Failures: 0, Errors: 0, Skipped: 5, Time elapsed: 0.055 s - in jmri.jmrix.rps.serial.ConnectionConfigTest
[INFO] Running jmri.jmrix.rps.serial.configurexml.ConnectionConfigXmlTest
[INFO] Tests run: 4, Failures: 0, Errors: 0, Skipped: 0, Time elapsed: 0.029 s - in jmri.jmrix.rps.serial.configurexml.ConnectionConfigXmlTest
[INFO] Running jmri.jmrix.rps.serial.SerialAdapterTest
[INFO] Tests run: 2, Failures: 0, Errors: 0, Skipped: 0, Time elapsed: 0.004 s - in jmri.jmrix.rps.serial.SerialAdapterTest
[INFO] Running jmri.jmrix.rps.ReceiverTest
[INFO] Tests run: 1, Failures: 0, Errors: 0, Skipped: 0, Time elapsed: 0 s - in jmri.jmrix.rps.ReceiverTest
[INFO] Running jmri.jmrix.rps.RegionTest
[INFO] Tests run: 5, Failures: 0, Errors: 0, Skipped: 0, Time elapsed: 0.002 s - in jmri.jmrix.rps.RegionTest
[INFO] Running jmri.jmrix.rps.Ash2_2AlgorithmTest
[INFO] Tests run: 7, Failures: 0, Errors: 0, Skipped: 0, Time elapsed: 0.012 s - in jmri.jmrix.rps.Ash2_2AlgorithmTest
[INFO] Running jmri.jmrix.rps.InitialAlgorithmTest
[INFO] Tests run: 5, Failures: 0, Errors: 0, Skipped: 0, Time elapsed: 0.008 s - in jmri.jmrix.rps.InitialAlgorithmTest
[INFO] Running jmri.jmrix.rps.RpsPositionIconTest
[INFO] Tests run: 1, Failures: 0, Errors: 0, Skipped: 0, Time elapsed: 0.395 s - in jmri.jmrix.rps.RpsPositionIconTest
[INFO] Running jmri.jmrix.rps.csvinput.CsvTest
[INFO] Tests run: 2, Failures: 0, Errors: 0, Skipped: 0, Time elapsed: 0.001 s - in jmri.jmrix.rps.csvinput.CsvTest
[INFO] Running jmri.jmrix.rps.EngineTest
[INFO] Tests run: 2, Failures: 0, Errors: 0, Skipped: 0, Time elapsed: 0.001 s - in jmri.jmrix.rps.EngineTest
[INFO] Running jmri.jmrix.rps.aligntable.AlignTablePaneTest
[INFO] Tests run: 1, Failures: 0, Errors: 0, Skipped: 0, Time elapsed: 0.018 s - in jmri.jmrix.rps.aligntable.AlignTablePaneTest
[INFO] Running jmri.jmrix.rps.aligntable.AlignTableFrameTest
[INFO] Tests run: 2, Failures: 0, Errors: 0, Skipped: 0, Time elapsed: 0.125 s - in jmri.jmrix.rps.aligntable.AlignTableFrameTest
[INFO] Running jmri.jmrix.rps.aligntable.AlignTableActionTest
[INFO] Tests run: 2, Failures: 0, Errors: 0, Skipped: 0, Time elapsed: 0.001 s - in jmri.jmrix.rps.aligntable.AlignTableActionTest
[INFO] Running jmri.jmrix.rps.Ash1_1AlgorithmTest
[INFO] Tests run: 4, Failures: 0, Errors: 0, Skipped: 0, Time elapsed: 0.013 s - in jmri.jmrix.rps.Ash1_1AlgorithmTest
[INFO] Running jmri.jmrix.rps.RpsSystemConnectionMemoTest
[INFO] Tests run: 11, Failures: 0, Errors: 0, Skipped: 0, Time elapsed: 0.01 s - in jmri.jmrix.rps.RpsSystemConnectionMemoTest
[INFO] Running jmri.jmrix.rps.RpsReporterManagerTest
[WARNING] Tests run: 23, Failures: 0, Errors: 0, Skipped: 1, Time elapsed: 0.019 s - in jmri.jmrix.rps.RpsReporterManagerTest
[INFO] Running jmri.jmrix.rps.MeasurementTest
[INFO] Tests run: 1, Failures: 0, Errors: 0, Skipped: 0, Time elapsed: 0 s - in jmri.jmrix.rps.MeasurementTest
[INFO] Running jmri.jmrix.rps.TransmitterTest
[INFO] Tests run: 1, Failures: 0, Errors: 0, Skipped: 0, Time elapsed: 0 s - in jmri.jmrix.rps.TransmitterTest
[INFO] Running jmri.jmrix.easydcc.EasyDccConsistManagerTest
[INFO] Tests run: 13, Failures: 0, Errors: 0, Skipped: 0, Time elapsed: 0.049 s - in jmri.jmrix.easydcc.EasyDccConsistManagerTest
[INFO] Running jmri.jmrix.easydcc.configurexml.EasyDccTurnoutManagerXmlTest
[INFO] Tests run: 1, Failures: 0, Errors: 0, Skipped: 0, Time elapsed: 0 s - in jmri.jmrix.easydcc.configurexml.EasyDccTurnoutManagerXmlTest
[INFO] Running jmri.jmrix.easydcc.serialdriver.ConnectionConfigTest
[WARNING] Tests run: 8, Failures: 0, Errors: 0, Skipped: 5, Time elapsed: 0.045 s - in jmri.jmrix.easydcc.serialdriver.ConnectionConfigTest
[INFO] Running jmri.jmrix.easydcc.serialdriver.configurexml.ConnectionConfigXmlTest
[INFO] Tests run: 4, Failures: 0, Errors: 0, Skipped: 0, Time elapsed: 0.038 s - in jmri.jmrix.easydcc.serialdriver.configurexml.ConnectionConfigXmlTest
[INFO] Running jmri.jmrix.easydcc.serialdriver.BundleTest
[INFO] Tests run: 2, Failures: 0, Errors: 0, Skipped: 0, Time elapsed: 0 s - in jmri.jmrix.easydcc.serialdriver.BundleTest
[INFO] Running jmri.jmrix.easydcc.serialdriver.SerialDriverAdapterTest
[INFO] Tests run: 1, Failures: 0, Errors: 0, Skipped: 0, Time elapsed: 0 s - in jmri.jmrix.easydcc.serialdriver.SerialDriverAdapterTest
[INFO] Running jmri.jmrix.easydcc.swing.EasyDccComponentFactoryTest
[INFO] Tests run: 1, Failures: 0, Errors: 0, Skipped: 0, Time elapsed: 0 s - in jmri.jmrix.easydcc.swing.EasyDccComponentFactoryTest
[INFO] Running jmri.jmrix.easydcc.EasyDccPowerManagerTest
[INFO] Tests run: 12, Failures: 0, Errors: 0, Skipped: 0, Time elapsed: 0.02 s - in jmri.jmrix.easydcc.EasyDccPowerManagerTest
[INFO] Running jmri.jmrix.easydcc.EasyDccTurnoutTest
[INFO] Tests run: 16, Failures: 0, Errors: 0, Skipped: 0, Time elapsed: 0.031 s - in jmri.jmrix.easydcc.EasyDccTurnoutTest
[INFO] Running jmri.jmrix.easydcc.BundleTest
[INFO] Tests run: 2, Failures: 0, Errors: 0, Skipped: 0, Time elapsed: 0 s - in jmri.jmrix.easydcc.BundleTest
[INFO] Running jmri.jmrix.easydcc.EasyDccMessageTest
[INFO] Tests run: 10, Failures: 0, Errors: 0, Skipped: 0, Time elapsed: 0 s - in jmri.jmrix.easydcc.EasyDccMessageTest
[INFO] Running jmri.jmrix.easydcc.EasyDccTurnoutManagerTest
[WARNING] Tests run: 20, Failures: 0, Errors: 0, Skipped: 1, Time elapsed: 0.031 s - in jmri.jmrix.easydcc.EasyDccTurnoutManagerTest
[INFO] Running jmri.jmrix.easydcc.EasyDccThrottleManagerTest
[INFO] Tests run: 17, Failures: 0, Errors: 0, Skipped: 0, Time elapsed: 0.028 s - in jmri.jmrix.easydcc.EasyDccThrottleManagerTest
[INFO] Running jmri.jmrix.easydcc.easydccmon.BundleTest
[INFO] Tests run: 2, Failures: 0, Errors: 0, Skipped: 0, Time elapsed: 0 s - in jmri.jmrix.easydcc.easydccmon.BundleTest
[INFO] Running jmri.jmrix.easydcc.easydccmon.EasyDccMonFrameTest
[WARNING] Tests run: 3, Failures: 0, Errors: 0, Skipped: 2, Time elapsed: 0.008 s - in jmri.jmrix.easydcc.easydccmon.EasyDccMonFrameTest
[INFO] Running jmri.jmrix.easydcc.easydccmon.EasyDccMonActionTest
[INFO] Tests run: 1, Failures: 0, Errors: 0, Skipped: 0, Time elapsed: 0.001 s - in jmri.jmrix.easydcc.easydccmon.EasyDccMonActionTest
[INFO] Running jmri.jmrix.easydcc.EasyDccConsistTest
[INFO] Tests run: 17, Failures: 0, Errors: 0, Skipped: 0, Time elapsed: 16.142 s - in jmri.jmrix.easydcc.EasyDccConsistTest
[INFO] Running jmri.jmrix.easydcc.EasyDccPortControllerTest
[INFO] Tests run: 1, Failures: 0, Errors: 0, Skipped: 0, Time elapsed: 0 s - in jmri.jmrix.easydcc.EasyDccPortControllerTest
[INFO] Running jmri.jmrix.easydcc.EasyDccCommandStationTest
[INFO] Tests run: 1, Failures: 0, Errors: 0, Skipped: 0, Time elapsed: 0 s - in jmri.jmrix.easydcc.EasyDccCommandStationTest
[INFO] Running jmri.jmrix.easydcc.EasyDccProgrammerTest
[INFO] Tests run: 17, Failures: 0, Errors: 0, Skipped: 0, Time elapsed: 0.026 s - in jmri.jmrix.easydcc.EasyDccProgrammerTest
[INFO] Running jmri.jmrix.easydcc.packetgen.EasyDccPacketGenFrameTest
[INFO] Tests run: 2, Failures: 0, Errors: 0, Skipped: 0, Time elapsed: 0.061 s - in jmri.jmrix.easydcc.packetgen.EasyDccPacketGenFrameTest
[INFO] Running jmri.jmrix.easydcc.packetgen.BundleTest
[INFO] Tests run: 2, Failures: 0, Errors: 0, Skipped: 0, Time elapsed: 0 s - in jmri.jmrix.easydcc.packetgen.BundleTest
[INFO] Running jmri.jmrix.easydcc.packetgen.EasyDccPacketGenActionTest
[INFO] Tests run: 2, Failures: 0, Errors: 0, Skipped: 0, Time elapsed: 0 s - in jmri.jmrix.easydcc.packetgen.EasyDccPacketGenActionTest
[INFO] Running jmri.jmrix.easydcc.EasyDccMenuTest
[INFO] Tests run: 1, Failures: 0, Errors: 0, Skipped: 0, Time elapsed: 0 s - in jmri.jmrix.easydcc.EasyDccMenuTest
[INFO] Running jmri.jmrix.easydcc.EasyDccProgrammerManagerTest
[INFO] Tests run: 1, Failures: 0, Errors: 0, Skipped: 0, Time elapsed: 0 s - in jmri.jmrix.easydcc.EasyDccProgrammerManagerTest
[INFO] Running jmri.jmrix.easydcc.EasyDccNetworkPortControllerTest
[INFO] Tests run: 1, Failures: 0, Errors: 0, Skipped: 0, Time elapsed: 0 s - in jmri.jmrix.easydcc.EasyDccNetworkPortControllerTest
[INFO] Running jmri.jmrix.easydcc.EasyDccTrafficControllerTest
[INFO] Tests run: 7, Failures: 0, Errors: 0, Skipped: 0, Time elapsed: 1.025 s - in jmri.jmrix.easydcc.EasyDccTrafficControllerTest
[INFO] Running jmri.jmrix.easydcc.EasyDccSystemConnectionMemoTest
[INFO] Tests run: 10, Failures: 0, Errors: 0, Skipped: 0, Time elapsed: 0.015 s - in jmri.jmrix.easydcc.EasyDccSystemConnectionMemoTest
[INFO] Running jmri.jmrix.easydcc.EasyDccReplyTest
[INFO] Tests run: 9, Failures: 0, Errors: 0, Skipped: 0, Time elapsed: 0.003 s - in jmri.jmrix.easydcc.EasyDccReplyTest
[INFO] Running jmri.jmrix.easydcc.EasyDccThrottleTest
[INFO] Tests run: 151, Failures: 0, Errors: 0, Skipped: 0, Time elapsed: 0.298 s - in jmri.jmrix.easydcc.EasyDccThrottleTest
[INFO] Running jmri.jmrix.easydcc.networkdriver.ConnectionConfigTest
[WARNING] Tests run: 8, Failures: 0, Errors: 0, Skipped: 5, Time elapsed: 0.021 s - in jmri.jmrix.easydcc.networkdriver.ConnectionConfigTest
[INFO] Running jmri.jmrix.easydcc.networkdriver.configurexml.ConnectionConfigXmlTest
[INFO] Tests run: 4, Failures: 0, Errors: 0, Skipped: 0, Time elapsed: 0.027 s - in jmri.jmrix.easydcc.networkdriver.configurexml.ConnectionConfigXmlTest
[INFO] Running jmri.jmrix.easydcc.networkdriver.BundleTest
[INFO] Tests run: 2, Failures: 0, Errors: 0, Skipped: 0, Time elapsed: 0 s - in jmri.jmrix.easydcc.networkdriver.BundleTest
[INFO] Running jmri.jmrix.easydcc.networkdriver.NetworkDriverAdapterTest
[INFO] Tests run: 1, Failures: 0, Errors: 0, Skipped: 0, Time elapsed: 0 s - in jmri.jmrix.easydcc.networkdriver.NetworkDriverAdapterTest
[INFO] Running jmri.jmrix.easydcc.EasyDccConnectionTypeListTest
[INFO] Tests run: 1, Failures: 0, Errors: 0, Skipped: 0, Time elapsed: 0 s - in jmri.jmrix.easydcc.EasyDccConnectionTypeListTest
[INFO] Running jmri.jmrix.easydcc.EasyDccOpsModeProgrammerTest
[INFO] Tests run: 14, Failures: 0, Errors: 0, Skipped: 0, Time elapsed: 0.016 s - in jmri.jmrix.easydcc.EasyDccOpsModeProgrammerTest
[INFO] Running jmri.jmrix.easydcc.simulator.ConnectionConfigTest
[WARNING] Tests run: 8, Failures: 0, Errors: 0, Skipped: 5, Time elapsed: 0.013 s - in jmri.jmrix.easydcc.simulator.ConnectionConfigTest
[INFO] Running jmri.jmrix.easydcc.simulator.configurexml.ConnectionConfigXmlTest
[INFO] Tests run: 4, Failures: 0, Errors: 0, Skipped: 0, Time elapsed: 0.012 s - in jmri.jmrix.easydcc.simulator.configurexml.ConnectionConfigXmlTest
[INFO] Running jmri.jmrix.easydcc.simulator.EasyDccSimulatorTrafficControllerTest
[INFO] Tests run: 7, Failures: 0, Errors: 0, Skipped: 0, Time elapsed: 1.036 s - in jmri.jmrix.easydcc.simulator.EasyDccSimulatorTrafficControllerTest
[INFO] Running jmri.jmrix.easydcc.simulator.BundleTest
[INFO] Tests run: 2, Failures: 0, Errors: 0, Skipped: 0, Time elapsed: 0 s - in jmri.jmrix.easydcc.simulator.BundleTest
[INFO] Running jmri.jmrix.easydcc.simulator.SimulatorAdapterTest
[INFO] Tests run: 1, Failures: 0, Errors: 0, Skipped: 0, Time elapsed: 0 s - in jmri.jmrix.easydcc.simulator.SimulatorAdapterTest
[INFO] Running jmri.jmrix.direct.swing.DirectComponentFactoryTest
[INFO] Tests run: 1, Failures: 0, Errors: 0, Skipped: 0, Time elapsed: 0 s - in jmri.jmrix.direct.swing.DirectComponentFactoryTest
[INFO] Running jmri.jmrix.direct.DirectMenuTest
[INFO] Tests run: 2, Failures: 0, Errors: 0, Skipped: 0, Time elapsed: 0.006 s - in jmri.jmrix.direct.DirectMenuTest
[INFO] Running jmri.jmrix.direct.BundleTest
[INFO] Tests run: 2, Failures: 0, Errors: 0, Skipped: 0, Time elapsed: 0 s - in jmri.jmrix.direct.BundleTest
[INFO] Running jmri.jmrix.direct.PortControllerTest
[INFO] Tests run: 1, Failures: 0, Errors: 0, Skipped: 0, Time elapsed: 0 s - in jmri.jmrix.direct.PortControllerTest
[INFO] Running jmri.jmrix.direct.MakePacketTest
[WARNING] Tests run: 6, Failures: 0, Errors: 0, Skipped: 3, Time elapsed: 0 s - in jmri.jmrix.direct.MakePacketTest
[INFO] Running jmri.jmrix.direct.ThrottleManagerTest
[INFO] Tests run: 17, Failures: 0, Errors: 0, Skipped: 0, Time elapsed: 0.015 s - in jmri.jmrix.direct.ThrottleManagerTest
[INFO] Running jmri.jmrix.direct.MessageTest
[INFO] Tests run: 3, Failures: 0, Errors: 0, Skipped: 0, Time elapsed: 0.001 s - in jmri.jmrix.direct.MessageTest
[INFO] Running jmri.jmrix.direct.serial.ConnectionConfigTest
[WARNING] Tests run: 8, Failures: 0, Errors: 0, Skipped: 5, Time elapsed: 0.039 s - in jmri.jmrix.direct.serial.ConnectionConfigTest
[INFO] Running jmri.jmrix.direct.serial.configurexml.ConnectionConfigXmlTest
[INFO] Tests run: 4, Failures: 0, Errors: 0, Skipped: 0, Time elapsed: 0.029 s - in jmri.jmrix.direct.serial.configurexml.ConnectionConfigXmlTest
[INFO] Running jmri.jmrix.direct.serial.BundleTest
[INFO] Tests run: 2, Failures: 0, Errors: 0, Skipped: 0, Time elapsed: 0 s - in jmri.jmrix.direct.serial.BundleTest
[INFO] Running jmri.jmrix.direct.serial.SerialDriverAdapterTest
[INFO] Tests run: 1, Failures: 0, Errors: 0, Skipped: 0, Time elapsed: 0 s - in jmri.jmrix.direct.serial.SerialDriverAdapterTest
[INFO] Running jmri.jmrix.direct.ThrottleTest
[INFO] Tests run: 151, Failures: 0, Errors: 0, Skipped: 0, Time elapsed: 0.134 s - in jmri.jmrix.direct.ThrottleTest
[INFO] Running jmri.jmrix.direct.ReplyTest
[INFO] Tests run: 3, Failures: 0, Errors: 0, Skipped: 0, Time elapsed: 0 s - in jmri.jmrix.direct.ReplyTest
[INFO] Running jmri.jmrix.direct.DirectConnectionTypeListTest
[INFO] Tests run: 1, Failures: 0, Errors: 0, Skipped: 0, Time elapsed: 0 s - in jmri.jmrix.direct.DirectConnectionTypeListTest
[INFO] Running jmri.jmrix.direct.DirectSystemConnectionMemoTest
[INFO] Tests run: 10, Failures: 0, Errors: 0, Skipped: 0, Time elapsed: 0.003 s - in jmri.jmrix.direct.DirectSystemConnectionMemoTest
[INFO] Running jmri.jmrix.direct.TrafficControllerTest
[INFO] Tests run: 1, Failures: 0, Errors: 0, Skipped: 0, Time elapsed: 0 s - in jmri.jmrix.direct.TrafficControllerTest
[INFO] Running jmri.jmrix.direct.simulator.ConnectionConfigTest
[WARNING] Tests run: 8, Failures: 0, Errors: 0, Skipped: 5, Time elapsed: 0.013 s - in jmri.jmrix.direct.simulator.ConnectionConfigTest
[INFO] Running jmri.jmrix.direct.simulator.configurexml.ConnectionConfigXmlTest
[INFO] Tests run: 4, Failures: 0, Errors: 0, Skipped: 0, Time elapsed: 0.008 s - in jmri.jmrix.direct.simulator.configurexml.ConnectionConfigXmlTest
[INFO] Running jmri.jmrix.direct.simulator.BundleTest
[INFO] Tests run: 6, Failures: 0, Errors: 0, Skipped: 0, Time elapsed: 0.001 s - in jmri.jmrix.direct.simulator.BundleTest
[INFO] Running jmri.jmrix.direct.simulator.SimulatorAdapterTest
[INFO] Tests run: 1, Failures: 0, Errors: 0, Skipped: 0, Time elapsed: 0 s - in jmri.jmrix.direct.simulator.SimulatorAdapterTest
[INFO] Running jmri.jmrix.libusb.BundleTest
[INFO] Tests run: 2, Failures: 0, Errors: 0, Skipped: 0, Time elapsed: 0.006 s - in jmri.jmrix.libusb.BundleTest
[INFO] Running jmri.jmrix.libusb.UsbViewActionTest
[INFO] Tests run: 1, Failures: 0, Errors: 0, Skipped: 0, Time elapsed: 0 s - in jmri.jmrix.libusb.UsbViewActionTest
[INFO] Running jmri.jmrix.srcp.configurexml.SRCPSensorManagerXmlTest
[INFO] Tests run: 1, Failures: 0, Errors: 0, Skipped: 0, Time elapsed: 0 s - in jmri.jmrix.srcp.configurexml.SRCPSensorManagerXmlTest
[INFO] Running jmri.jmrix.srcp.configurexml.SRCPTurnoutManagerXmlTest
[INFO] Tests run: 1, Failures: 0, Errors: 0, Skipped: 0, Time elapsed: 0 s - in jmri.jmrix.srcp.configurexml.SRCPTurnoutManagerXmlTest
[INFO] Running jmri.jmrix.srcp.SRCPPowerManagerTest
[WARNING] Tests run: 12, Failures: 0, Errors: 0, Skipped: 2, Time elapsed: 0.032 s - in jmri.jmrix.srcp.SRCPPowerManagerTest
[INFO] Running jmri.jmrix.srcp.SRCPProgrammerTest
[INFO] Tests run: 12, Failures: 0, Errors: 0, Skipped: 0, Time elapsed: 0.026 s - in jmri.jmrix.srcp.SRCPProgrammerTest
[INFO] Running jmri.jmrix.srcp.swing.BundleTest
[INFO] Tests run: 2, Failures: 0, Errors: 0, Skipped: 0, Time elapsed: 0.004 s - in jmri.jmrix.srcp.swing.BundleTest
[INFO] Running jmri.jmrix.srcp.swing.srcpmon.SRCPMonActionTest
[INFO] Tests run: 1, Failures: 0, Errors: 0, Skipped: 0, Time elapsed: 0.006 s - in jmri.jmrix.srcp.swing.srcpmon.SRCPMonActionTest
[INFO] Running jmri.jmrix.srcp.swing.srcpmon.SRCPMonPaneTest
[INFO] Tests run: 14, Failures: 0, Errors: 0, Skipped: 0, Time elapsed: 1.478 s - in jmri.jmrix.srcp.swing.srcpmon.SRCPMonPaneTest
[INFO] Running jmri.jmrix.srcp.swing.srcpmon.BundleTest
[INFO] Tests run: 2, Failures: 0, Errors: 0, Skipped: 0, Time elapsed: 0 s - in jmri.jmrix.srcp.swing.srcpmon.BundleTest
[INFO] Running jmri.jmrix.srcp.swing.packetgen.BundleTest
[INFO] Tests run: 2, Failures: 0, Errors: 0, Skipped: 0, Time elapsed: 0 s - in jmri.jmrix.srcp.swing.packetgen.BundleTest
[INFO] Running jmri.jmrix.srcp.swing.packetgen.PacketGenActionTest
[INFO] Tests run: 1, Failures: 0, Errors: 0, Skipped: 0, Time elapsed: 0 s - in jmri.jmrix.srcp.swing.packetgen.PacketGenActionTest
[INFO] Running jmri.jmrix.srcp.swing.packetgen.PacketGenFrameTest
[INFO] Tests run: 2, Failures: 0, Errors: 0, Skipped: 0, Time elapsed: 0.051 s - in jmri.jmrix.srcp.swing.packetgen.PacketGenFrameTest
[INFO] Running jmri.jmrix.srcp.swing.SystemMenuTest
[INFO] Tests run: 2, Failures: 0, Errors: 0, Skipped: 0, Time elapsed: 0.006 s - in jmri.jmrix.srcp.swing.SystemMenuTest
[INFO] Running jmri.jmrix.srcp.swing.SRCPComponentFactoryTest
[INFO] Tests run: 1, Failures: 0, Errors: 0, Skipped: 0, Time elapsed: 0.002 s - in jmri.jmrix.srcp.swing.SRCPComponentFactoryTest
[INFO] Running jmri.jmrix.srcp.SRCPSystemConnectionMemoTest
[INFO] Tests run: 11, Failures: 0, Errors: 0, Skipped: 0, Time elapsed: 0.02 s - in jmri.jmrix.srcp.SRCPSystemConnectionMemoTest
[INFO] Running jmri.jmrix.srcp.SRCPThrottleManagerTest
[INFO] Tests run: 16, Failures: 0, Errors: 0, Skipped: 0, Time elapsed: 0.026 s - in jmri.jmrix.srcp.SRCPThrottleManagerTest
[INFO] Running jmri.jmrix.srcp.SRCPReplyTest
[INFO] Tests run: 8, Failures: 0, Errors: 0, Skipped: 0, Time elapsed: 0.043 s - in jmri.jmrix.srcp.SRCPReplyTest
[INFO] Running jmri.jmrix.srcp.BundleTest
[INFO] Tests run: 2, Failures: 0, Errors: 0, Skipped: 0, Time elapsed: 0 s - in jmri.jmrix.srcp.BundleTest
[INFO] Running jmri.jmrix.srcp.SRCPTurnoutManagerTest
[WARNING] Tests run: 21, Failures: 0, Errors: 0, Skipped: 1, Time elapsed: 0.037 s - in jmri.jmrix.srcp.SRCPTurnoutManagerTest
[INFO] Running jmri.jmrix.srcp.SRCPSensorTest
[INFO] Tests run: 14, Failures: 0, Errors: 0, Skipped: 0, Time elapsed: 0.14 s - in jmri.jmrix.srcp.SRCPSensorTest
[INFO] Running jmri.jmrix.srcp.SRCPPortControllerTest
[INFO] Tests run: 1, Failures: 0, Errors: 0, Skipped: 0, Time elapsed: 0 s - in jmri.jmrix.srcp.SRCPPortControllerTest
[INFO] Running jmri.jmrix.srcp.SRCPTrafficControllerTest
[INFO] Tests run: 6, Failures: 0, Errors: 0, Skipped: 0, Time elapsed: 0.003 s - in jmri.jmrix.srcp.SRCPTrafficControllerTest
[INFO] Running jmri.jmrix.srcp.SRCPMessageTest
[INFO] Tests run: 22, Failures: 0, Errors: 0, Skipped: 0, Time elapsed: 0.012 s - in jmri.jmrix.srcp.SRCPMessageTest
[INFO] Running jmri.jmrix.srcp.SRCPThrottleTest
[INFO] Tests run: 151, Failures: 0, Errors: 0, Skipped: 0, Time elapsed: 0.233 s - in jmri.jmrix.srcp.SRCPThrottleTest
[INFO] Running jmri.jmrix.srcp.SRCPConnectionTypeListTest
[INFO] Tests run: 1, Failures: 0, Errors: 0, Skipped: 0, Time elapsed: 0 s - in jmri.jmrix.srcp.SRCPConnectionTypeListTest
[INFO] Running jmri.jmrix.srcp.SRCPTurnoutTest
[WARNING] Tests run: 17, Failures: 0, Errors: 0, Skipped: 3, Time elapsed: 0.027 s - in jmri.jmrix.srcp.SRCPTurnoutTest
[INFO] Running jmri.jmrix.srcp.SRCPClockControlTest
[INFO] Tests run: 1, Failures: 0, Errors: 0, Skipped: 0, Time elapsed: 0.002 s - in jmri.jmrix.srcp.SRCPClockControlTest
[INFO] Running jmri.jmrix.srcp.SRCPProgrammerManagerTest
[INFO] Tests run: 1, Failures: 0, Errors: 0, Skipped: 0, Time elapsed: 0.001 s - in jmri.jmrix.srcp.SRCPProgrammerManagerTest
[INFO] Running jmri.jmrix.srcp.SRCPBusConnectionMemoTest
[INFO] Tests run: 10, Failures: 0, Errors: 0, Skipped: 0, Time elapsed: 0.012 s - in jmri.jmrix.srcp.SRCPBusConnectionMemoTest
[INFO] Running jmri.jmrix.srcp.networkdriver.ConnectionConfigTest
[WARNING] Tests run: 8, Failures: 0, Errors: 0, Skipped: 5, Time elapsed: 0.012 s - in jmri.jmrix.srcp.networkdriver.ConnectionConfigTest
[INFO] Running jmri.jmrix.srcp.networkdriver.configurexml.ConnectionConfigXmlTest
[INFO] Tests run: 4, Failures: 0, Errors: 0, Skipped: 0, Time elapsed: 0.012 s - in jmri.jmrix.srcp.networkdriver.configurexml.ConnectionConfigXmlTest
[INFO] Running jmri.jmrix.srcp.networkdriver.NetworkDriverAdapterTest
[INFO] Tests run: 1, Failures: 0, Errors: 0, Skipped: 0, Time elapsed: 0.001 s - in jmri.jmrix.srcp.networkdriver.NetworkDriverAdapterTest
[INFO] Running jmri.jmrix.srcp.parser.SRCPClientVisitorTest
[INFO] Tests run: 64, Failures: 0, Errors: 0, Skipped: 0, Time elapsed: 0.125 s - in jmri.jmrix.srcp.parser.SRCPClientVisitorTest
[INFO] Running jmri.jmrix.srcp.parser.SRCPClientParserTokenizerTest
[INFO] Tests run: 25, Failures: 0, Errors: 0, Skipped: 0, Time elapsed: 0.015 s - in jmri.jmrix.srcp.parser.SRCPClientParserTokenizerTest
[INFO] Running jmri.jmrix.srcp.parser.SRCPClientParserTest
[INFO] Tests run: 69, Failures: 0, Errors: 0, Skipped: 0, Time elapsed: 0.044 s - in jmri.jmrix.srcp.parser.SRCPClientParserTest
[INFO] Running jmri.jmrix.srcp.SRCPSensorManagerTest
[WARNING] Tests run: 21, Failures: 0, Errors: 0, Skipped: 1, Time elapsed: 0.031 s - in jmri.jmrix.srcp.SRCPSensorManagerTest
[INFO] Running jmri.jmrix.AbstractMRTrafficControllerTest
[INFO] Tests run: 6, Failures: 0, Errors: 0, Skipped: 0, Time elapsed: 0.004 s - in jmri.jmrix.AbstractMRTrafficControllerTest
[INFO] Running jmri.jmrix.AbstractMonFrameTest
[INFO] Tests run: 2, Failures: 0, Errors: 0, Skipped: 0, Time elapsed: 0.102 s - in jmri.jmrix.AbstractMonFrameTest
[INFO] Running jmri.jmrix.zimo.Mx1ExceptionTest
[INFO] Tests run: 1, Failures: 0, Errors: 0, Skipped: 0, Time elapsed: 0 s - in jmri.jmrix.zimo.Mx1ExceptionTest
[INFO] Running jmri.jmrix.zimo.Mx1SystemConnectionMemoTest
[INFO] Tests run: 10, Failures: 0, Errors: 0, Skipped: 0, Time elapsed: 0.026 s - in jmri.jmrix.zimo.Mx1SystemConnectionMemoTest
[INFO] Running jmri.jmrix.zimo.Mx1ProgrammerTest
[INFO] Tests run: 12, Failures: 0, Errors: 0, Skipped: 0, Time elapsed: 0.014 s - in jmri.jmrix.zimo.Mx1ProgrammerTest
[INFO] Running jmri.jmrix.zimo.swing.Mx1ComponentFactoryTest
[INFO] Tests run: 1, Failures: 0, Errors: 0, Skipped: 0, Time elapsed: 0 s - in jmri.jmrix.zimo.swing.Mx1ComponentFactoryTest
[INFO] Running jmri.jmrix.zimo.swing.BundleTest
[INFO] Tests run: 6, Failures: 0, Errors: 0, Skipped: 0, Time elapsed: 0.007 s - in jmri.jmrix.zimo.swing.BundleTest
[INFO] Running jmri.jmrix.zimo.swing.packetgen.BundleTest
[INFO] Tests run: 6, Failures: 0, Errors: 0, Skipped: 0, Time elapsed: 0.007 s - in jmri.jmrix.zimo.swing.packetgen.BundleTest
[INFO] Running jmri.jmrix.zimo.swing.packetgen.Mx1PacketGenPanelTest
[INFO] Tests run: 4, Failures: 0, Errors: 0, Skipped: 0, Time elapsed: 0.002 s - in jmri.jmrix.zimo.swing.packetgen.Mx1PacketGenPanelTest
[INFO] Running jmri.jmrix.zimo.swing.monitor.Mx1MonPanelTest
[INFO] Tests run: 4, Failures: 0, Errors: 0, Skipped: 0, Time elapsed: 0.033 s - in jmri.jmrix.zimo.swing.monitor.Mx1MonPanelTest
[INFO] Running jmri.jmrix.zimo.swing.Mx1MenuTest
[INFO] Tests run: 1, Failures: 0, Errors: 0, Skipped: 0, Time elapsed: 0.004 s - in jmri.jmrix.zimo.swing.Mx1MenuTest
[INFO] Running jmri.jmrix.zimo.swing.Mx1NamedPaneActionTest
[INFO] Tests run: 1, Failures: 0, Errors: 0, Skipped: 0, Time elapsed: 0.01 s - in jmri.jmrix.zimo.swing.Mx1NamedPaneActionTest
[INFO] Running jmri.jmrix.zimo.Mx1CommandStationTest
[INFO] Tests run: 1, Failures: 0, Errors: 0, Skipped: 0, Time elapsed: 0 s - in jmri.jmrix.zimo.Mx1CommandStationTest
[INFO] Running jmri.jmrix.zimo.Mx1PowerManagerTest
[INFO] Tests run: 1, Failures: 0, Errors: 0, Skipped: 0, Time elapsed: 0 s - in jmri.jmrix.zimo.Mx1PowerManagerTest
[INFO] Running jmri.jmrix.zimo.BundleTest
[INFO] Tests run: 6, Failures: 0, Errors: 0, Skipped: 0, Time elapsed: 0.005 s - in jmri.jmrix.zimo.BundleTest
[INFO] Running jmri.jmrix.zimo.Mx1PortControllerTest
[INFO] Tests run: 1, Failures: 0, Errors: 0, Skipped: 0, Time elapsed: 0.001 s - in jmri.jmrix.zimo.Mx1PortControllerTest
[INFO] Running jmri.jmrix.zimo.mx1.ConnectionConfigTest
[WARNING] Tests run: 8, Failures: 0, Errors: 0, Skipped: 5, Time elapsed: 0.036 s - in jmri.jmrix.zimo.mx1.ConnectionConfigTest
[INFO] Running jmri.jmrix.zimo.mx1.configurexml.ConnectionConfigXmlTest
[INFO] Tests run: 4, Failures: 0, Errors: 0, Skipped: 0, Time elapsed: 0.021 s - in jmri.jmrix.zimo.mx1.configurexml.ConnectionConfigXmlTest
[INFO] Running jmri.jmrix.zimo.mx1.Mx1AdapterTest
[INFO] Tests run: 1, Failures: 0, Errors: 0, Skipped: 0, Time elapsed: 0.001 s - in jmri.jmrix.zimo.mx1.Mx1AdapterTest
[INFO] Running jmri.jmrix.zimo.mx1.BundleTest
[INFO] Tests run: 6, Failures: 0, Errors: 0, Skipped: 0, Time elapsed: 0 s - in jmri.jmrix.zimo.mx1.BundleTest
[INFO] Running jmri.jmrix.zimo.Mx1ConnectionTypeListTest
[INFO] Tests run: 1, Failures: 0, Errors: 0, Skipped: 0, Time elapsed: 0 s - in jmri.jmrix.zimo.Mx1ConnectionTypeListTest
[INFO] Running jmri.jmrix.zimo.Mx1TurnoutTest
[INFO] Tests run: 1, Failures: 0, Errors: 0, Skipped: 0, Time elapsed: 0 s - in jmri.jmrix.zimo.Mx1TurnoutTest
[INFO] Running jmri.jmrix.zimo.Mx1TurnoutManagerTest
[INFO] Tests run: 1, Failures: 0, Errors: 0, Skipped: 0, Time elapsed: 0 s - in jmri.jmrix.zimo.Mx1TurnoutManagerTest
[INFO] Running jmri.jmrix.zimo.Mx1TrafficControllerTest
[INFO] Tests run: 1, Failures: 0, Errors: 0, Skipped: 0, Time elapsed: 0 s - in jmri.jmrix.zimo.Mx1TrafficControllerTest
[INFO] Running jmri.jmrix.zimo.Mx1PacketizerTest
[INFO] Tests run: 1, Failures: 0, Errors: 0, Skipped: 0, Time elapsed: 0.004 s - in jmri.jmrix.zimo.Mx1PacketizerTest
[INFO] Running jmri.jmrix.zimo.Mx1ThrottleManagerTest
[INFO] Tests run: 17, Failures: 0, Errors: 0, Skipped: 0, Time elapsed: 0.024 s - in jmri.jmrix.zimo.Mx1ThrottleManagerTest
[INFO] Running jmri.jmrix.zimo.Mx1MessageExceptionTest
[INFO] Tests run: 2, Failures: 0, Errors: 0, Skipped: 0, Time elapsed: 0 s - in jmri.jmrix.zimo.Mx1MessageExceptionTest
[INFO] Running jmri.jmrix.zimo.Mx1MessageTest
[INFO] Tests run: 1, Failures: 0, Errors: 0, Skipped: 0, Time elapsed: 0 s - in jmri.jmrix.zimo.Mx1MessageTest
[INFO] Running jmri.jmrix.zimo.Mx1ThrottleTest
[INFO] Tests run: 151, Failures: 0, Errors: 0, Skipped: 0, Time elapsed: 0.197 s - in jmri.jmrix.zimo.Mx1ThrottleTest
[INFO] Running jmri.jmrix.zimo.Mx1ProgrammerManagerTest
[INFO] Tests run: 1, Failures: 0, Errors: 0, Skipped: 0, Time elapsed: 0 s - in jmri.jmrix.zimo.Mx1ProgrammerManagerTest
[INFO] Running jmri.jmrix.zimo.mxulf.ConnectionConfigTest
[WARNING] Tests run: 8, Failures: 0, Errors: 0, Skipped: 5, Time elapsed: 0.032 s - in jmri.jmrix.zimo.mxulf.ConnectionConfigTest
[INFO] Running jmri.jmrix.zimo.mxulf.configurexml.ConnectionConfigXmlTest
[INFO] Tests run: 4, Failures: 0, Errors: 0, Skipped: 0, Time elapsed: 0.034 s - in jmri.jmrix.zimo.mxulf.configurexml.ConnectionConfigXmlTest
[INFO] Running jmri.jmrix.zimo.mxulf.BundleTest
[INFO] Tests run: 6, Failures: 0, Errors: 0, Skipped: 0, Time elapsed: 0 s - in jmri.jmrix.zimo.mxulf.BundleTest
[INFO] Running jmri.jmrix.zimo.mxulf.SerialDriverAdapterTest
[INFO] Tests run: 1, Failures: 0, Errors: 0, Skipped: 0, Time elapsed: 0 s - in jmri.jmrix.zimo.mxulf.SerialDriverAdapterTest
[INFO] Running jmri.jmrix.BundleTest
[INFO] Tests run: 2, Failures: 0, Errors: 0, Skipped: 0, Time elapsed: 0 s - in jmri.jmrix.BundleTest
[INFO] Running jmri.jmrix.bachrus.SpeedoSystemConnectionMemoTest
[INFO] Tests run: 10, Failures: 0, Errors: 0, Skipped: 0, Time elapsed: 0.001 s - in jmri.jmrix.bachrus.SpeedoSystemConnectionMemoTest
[INFO] Running jmri.jmrix.bachrus.serialdriver.ConnectionConfigTest
[WARNING] Tests run: 8, Failures: 0, Errors: 0, Skipped: 5, Time elapsed: 0.038 s - in jmri.jmrix.bachrus.serialdriver.ConnectionConfigTest
[INFO] Running jmri.jmrix.bachrus.serialdriver.configurexml.ConnectionConfigXmlTest
[INFO] Tests run: 4, Failures: 0, Errors: 0, Skipped: 0, Time elapsed: 0.021 s - in jmri.jmrix.bachrus.serialdriver.configurexml.ConnectionConfigXmlTest
[INFO] Running jmri.jmrix.bachrus.serialdriver.BundleTest
[INFO] Tests run: 2, Failures: 0, Errors: 0, Skipped: 0, Time elapsed: 0.003 s - in jmri.jmrix.bachrus.serialdriver.BundleTest
[INFO] Running jmri.jmrix.bachrus.serialdriver.SerialDriverAdapterTest
[INFO] Tests run: 1, Failures: 0, Errors: 0, Skipped: 0, Time elapsed: 0 s - in jmri.jmrix.bachrus.serialdriver.SerialDriverAdapterTest
[INFO] Running jmri.jmrix.bachrus.swing.SpeedoComponentFactoryTest
[INFO] Tests run: 1, Failures: 0, Errors: 0, Skipped: 0, Time elapsed: 0 s - in jmri.jmrix.bachrus.swing.SpeedoComponentFactoryTest
[INFO] Running jmri.jmrix.bachrus.swing.BundleTest
[INFO] Tests run: 2, Failures: 0, Errors: 0, Skipped: 0, Time elapsed: 0 s - in jmri.jmrix.bachrus.swing.BundleTest
[INFO] Running jmri.jmrix.bachrus.SpeedoTrafficControllerTest
[INFO] Tests run: 1, Failures: 0, Errors: 0, Skipped: 0, Time elapsed: 0 s - in jmri.jmrix.bachrus.SpeedoTrafficControllerTest
[INFO] Running jmri.jmrix.bachrus.SpeedoConsoleFrameTest
[INFO] Tests run: 2, Failures: 0, Errors: 0, Skipped: 0, Time elapsed: 0.183 s - in jmri.jmrix.bachrus.SpeedoConsoleFrameTest
[INFO] Running jmri.jmrix.bachrus.SpeedoMenuTest
[INFO] Tests run: 1, Failures: 0, Errors: 0, Skipped: 0, Time elapsed: 0.001 s - in jmri.jmrix.bachrus.SpeedoMenuTest
[INFO] Running jmri.jmrix.bachrus.SpeedoDialTest
[INFO] Tests run: 2, Failures: 0, Errors: 0, Skipped: 0, Time elapsed: 0.068 s - in jmri.jmrix.bachrus.SpeedoDialTest
[INFO] Running jmri.jmrix.bachrus.BundleTest
[INFO] Tests run: 2, Failures: 0, Errors: 0, Skipped: 0, Time elapsed: 0 s - in jmri.jmrix.bachrus.BundleTest
[INFO] Running jmri.jmrix.bachrus.DccSpeedProfileTest
[INFO] Tests run: 7, Failures: 0, Errors: 0, Skipped: 0, Time elapsed: 0.005 s - in jmri.jmrix.bachrus.DccSpeedProfileTest
[INFO] Running jmri.jmrix.bachrus.SpeedoConsoleActionTest
[INFO] Tests run: 2, Failures: 0, Errors: 0, Skipped: 0, Time elapsed: 0.153 s - in jmri.jmrix.bachrus.SpeedoConsoleActionTest
[INFO] Running jmri.jmrix.bachrus.SpeedTest
[INFO] Tests run: 2, Failures: 0, Errors: 0, Skipped: 0, Time elapsed: 0 s - in jmri.jmrix.bachrus.SpeedTest
[INFO] Running jmri.jmrix.bachrus.SpeedoReplyTest
[INFO] Tests run: 4, Failures: 0, Errors: 0, Skipped: 0, Time elapsed: 0 s - in jmri.jmrix.bachrus.SpeedoReplyTest
[INFO] Running jmri.jmrix.bachrus.GraphPaneTest
[INFO] Tests run: 1, Failures: 0, Errors: 0, Skipped: 0, Time elapsed: 0 s - in jmri.jmrix.bachrus.GraphPaneTest
[INFO] Running jmri.jmrix.bachrus.SpeedoConnectionTypeListTest
[INFO] Tests run: 1, Failures: 0, Errors: 0, Skipped: 0, Time elapsed: 0 s - in jmri.jmrix.bachrus.SpeedoConnectionTypeListTest
[INFO] Running jmri.jmrix.bachrus.SpeedoPortControllerTest
[INFO] Tests run: 1, Failures: 0, Errors: 0, Skipped: 0, Time elapsed: 0 s - in jmri.jmrix.bachrus.SpeedoPortControllerTest
[INFO] Running jmri.jmrix.AbstractProgrammerTest
[INFO] Tests run: 12, Failures: 0, Errors: 0, Skipped: 0, Time elapsed: 0.002 s - in jmri.jmrix.AbstractProgrammerTest
[INFO] Running jmri.jmrix.anyma.AnymaDMX_ConnectionTypeListTest
[INFO] Tests run: 1, Failures: 0, Errors: 0, Skipped: 0, Time elapsed: 0 s - in jmri.jmrix.anyma.AnymaDMX_ConnectionTypeListTest
[INFO] Running jmri.jmrix.anyma.configurexml.UsbLightManagerXmlTest
[INFO] Tests run: 1, Failures: 0, Errors: 0, Skipped: 0, Time elapsed: 0 s - in jmri.jmrix.anyma.configurexml.UsbLightManagerXmlTest
[INFO] Running jmri.jmrix.anyma.configurexml.AnymaDMX_ConnectionConfigXmlTest
[WARNING] Tests run: 4, Failures: 0, Errors: 0, Skipped: 2, Time elapsed: 0.01 s - in jmri.jmrix.anyma.configurexml.AnymaDMX_ConnectionConfigXmlTest
[INFO] Running jmri.jmrix.anyma.AnymaDMX_SystemConnectionMemoTest
[INFO] Tests run: 11, Failures: 0, Errors: 0, Skipped: 0, Time elapsed: 0.007 s - in jmri.jmrix.anyma.AnymaDMX_SystemConnectionMemoTest
[INFO] Running jmri.jmrix.anyma.BundleTest
[INFO] Tests run: 2, Failures: 0, Errors: 0, Skipped: 0, Time elapsed: 0.005 s - in jmri.jmrix.anyma.BundleTest
[INFO] Running jmri.jmrix.anyma.AnymaDMX_TrafficControllerTest
[INFO] Tests run: 1, Failures: 0, Errors: 0, Skipped: 0, Time elapsed: 0.004 s - in jmri.jmrix.anyma.AnymaDMX_TrafficControllerTest
[INFO] Running jmri.jmrix.anyma.AnymaDMX_UsbPortAdapterTest
[INFO] Tests run: 1, Failures: 0, Errors: 0, Skipped: 0, Time elapsed: 0 s - in jmri.jmrix.anyma.AnymaDMX_UsbPortAdapterTest
[INFO] Running jmri.jmrix.anyma.AnymaDMX_ConnectionConfigTest
[WARNING] Tests run: 8, Failures: 0, Errors: 0, Skipped: 1, Time elapsed: 0.023 s - in jmri.jmrix.anyma.AnymaDMX_ConnectionConfigTest
[INFO] Running jmri.jmrix.anyma.AnymaDMX_UsbLightTest
[INFO] Tests run: 9, Failures: 0, Errors: 0, Skipped: 0, Time elapsed: 0.008 s - in jmri.jmrix.anyma.AnymaDMX_UsbLightTest
[INFO] Running jmri.jmrix.anyma.UsbLightManagerTest
[INFO] Tests run: 19, Failures: 0, Errors: 0, Skipped: 0, Time elapsed: 0.016 s - in jmri.jmrix.anyma.UsbLightManagerTest
[INFO] Running jmri.jmrix.SystemConnectionMemoManagerTest
[INFO] Tests run: 1, Failures: 0, Errors: 0, Skipped: 0, Time elapsed: 0 s - in jmri.jmrix.SystemConnectionMemoManagerTest
[INFO] Running jmri.jmrix.OtherConnectionTypeListTest
[INFO] Tests run: 1, Failures: 0, Errors: 0, Skipped: 0, Time elapsed: 0 s - in jmri.jmrix.OtherConnectionTypeListTest
[INFO] Running jmri.jmrix.SystemConnectionMemoTest
[INFO] Tests run: 7, Failures: 0, Errors: 0, Skipped: 0, Time elapsed: 0 s - in jmri.jmrix.SystemConnectionMemoTest
[INFO] Running jmri.jmrix.AbstractMRMessageTest
[INFO] Tests run: 3, Failures: 0, Errors: 0, Skipped: 0, Time elapsed: 0 s - in jmri.jmrix.AbstractMRMessageTest
[INFO] Running jmri.jmrix.xpa.XpaTurnoutTest
[INFO] Tests run: 17, Failures: 0, Errors: 0, Skipped: 0, Time elapsed: 0.022 s - in jmri.jmrix.xpa.XpaTurnoutTest
[INFO] Running jmri.jmrix.xpa.configurexml.XpaTurnoutManagerXmlTest
[INFO] Tests run: 1, Failures: 0, Errors: 0, Skipped: 0, Time elapsed: 0 s - in jmri.jmrix.xpa.configurexml.XpaTurnoutManagerXmlTest
[INFO] Running jmri.jmrix.xpa.XpaThrottleTest
[INFO] Tests run: 151, Failures: 0, Errors: 0, Skipped: 0, Time elapsed: 0.106 s - in jmri.jmrix.xpa.XpaThrottleTest
[INFO] Running jmri.jmrix.xpa.serialdriver.ConnectionConfigTest
[WARNING] Tests run: 8, Failures: 0, Errors: 0, Skipped: 5, Time elapsed: 0.04 s - in jmri.jmrix.xpa.serialdriver.ConnectionConfigTest
[INFO] Running jmri.jmrix.xpa.serialdriver.configurexml.ConnectionConfigXmlTest
[INFO] Tests run: 4, Failures: 0, Errors: 0, Skipped: 0, Time elapsed: 0.034 s - in jmri.jmrix.xpa.serialdriver.configurexml.ConnectionConfigXmlTest
[INFO] Running jmri.jmrix.xpa.serialdriver.BundleTest
[INFO] Tests run: 2, Failures: 0, Errors: 0, Skipped: 0, Time elapsed: 0 s - in jmri.jmrix.xpa.serialdriver.BundleTest
[INFO] Running jmri.jmrix.xpa.serialdriver.SerialDriverAdapterTest
[INFO] Tests run: 1, Failures: 0, Errors: 0, Skipped: 0, Time elapsed: 0 s - in jmri.jmrix.xpa.serialdriver.SerialDriverAdapterTest
[INFO] Running jmri.jmrix.xpa.swing.BundleTest
[INFO] Tests run: 2, Failures: 0, Errors: 0, Skipped: 0, Time elapsed: 0 s - in jmri.jmrix.xpa.swing.BundleTest
[INFO] Running jmri.jmrix.xpa.swing.packetgen.BundleTest
[INFO] Tests run: 2, Failures: 0, Errors: 0, Skipped: 0, Time elapsed: 0 s - in jmri.jmrix.xpa.swing.packetgen.BundleTest
[INFO] Running jmri.jmrix.xpa.swing.packetgen.XpaPacketGenFrameTest
[INFO] Tests run: 2, Failures: 0, Errors: 0, Skipped: 0, Time elapsed: 0.056 s - in jmri.jmrix.xpa.swing.packetgen.XpaPacketGenFrameTest
[INFO] Running jmri.jmrix.xpa.swing.packetgen.XpaPacketGenActionTest
[INFO] Tests run: 1, Failures: 0, Errors: 0, Skipped: 0, Time elapsed: 0.001 s - in jmri.jmrix.xpa.swing.packetgen.XpaPacketGenActionTest
[INFO] Running jmri.jmrix.xpa.swing.XpaComponentFactoryTest
[INFO] Tests run: 1, Failures: 0, Errors: 0, Skipped: 0, Time elapsed: 0.001 s - in jmri.jmrix.xpa.swing.XpaComponentFactoryTest
[INFO] Running jmri.jmrix.xpa.swing.xpaconfig.BundleTest
[INFO] Tests run: 2, Failures: 0, Errors: 0, Skipped: 0, Time elapsed: 0 s - in jmri.jmrix.xpa.swing.xpaconfig.BundleTest
[INFO] Running jmri.jmrix.xpa.swing.xpaconfig.XpaConfigureActionTest
[INFO] Tests run: 1, Failures: 0, Errors: 0, Skipped: 0, Time elapsed: 0 s - in jmri.jmrix.xpa.swing.xpaconfig.XpaConfigureActionTest
[INFO] Running jmri.jmrix.xpa.swing.xpaconfig.XpaConfigureFrameTest
[INFO] Tests run: 2, Failures: 0, Errors: 0, Skipped: 0, Time elapsed: 0.061 s - in jmri.jmrix.xpa.swing.xpaconfig.XpaConfigureFrameTest
[INFO] Running jmri.jmrix.xpa.swing.XpaMenuTest
[INFO] Tests run: 1, Failures: 0, Errors: 0, Skipped: 0, Time elapsed: 0.002 s - in jmri.jmrix.xpa.swing.XpaMenuTest
[INFO] Running jmri.jmrix.xpa.swing.xpamon.XpaMonPaneTest
[INFO] Tests run: 13, Failures: 0, Errors: 0, Skipped: 0, Time elapsed: 1.35 s - in jmri.jmrix.xpa.swing.xpamon.XpaMonPaneTest
[INFO] Running jmri.jmrix.xpa.swing.xpamon.BundleTest
[INFO] Tests run: 2, Failures: 0, Errors: 0, Skipped: 0, Time elapsed: 0 s - in jmri.jmrix.xpa.swing.xpamon.BundleTest
[INFO] Running jmri.jmrix.xpa.swing.xpamon.XpaMonActionTest
[INFO] Tests run: 1, Failures: 0, Errors: 0, Skipped: 0, Time elapsed: 0 s - in jmri.jmrix.xpa.swing.xpamon.XpaMonActionTest
[INFO] Running jmri.jmrix.xpa.XpaSystemConnectionMemoTest
[INFO] Tests run: 11, Failures: 0, Errors: 0, Skipped: 0, Time elapsed: 0.004 s - in jmri.jmrix.xpa.XpaSystemConnectionMemoTest
[INFO] Running jmri.jmrix.xpa.XpaTrafficControllerTest
[INFO] Tests run: 1, Failures: 0, Errors: 0, Skipped: 0, Time elapsed: 0 s - in jmri.jmrix.xpa.XpaTrafficControllerTest
[INFO] Running jmri.jmrix.xpa.BundleTest
[INFO] Tests run: 2, Failures: 0, Errors: 0, Skipped: 0, Time elapsed: 0 s - in jmri.jmrix.xpa.BundleTest
[INFO] Running jmri.jmrix.xpa.XpaPortControllerTest
[INFO] Tests run: 1, Failures: 0, Errors: 0, Skipped: 0, Time elapsed: 0 s - in jmri.jmrix.xpa.XpaPortControllerTest
[INFO] Running jmri.jmrix.xpa.XpaPowerManagerTest
[INFO] Tests run: 12, Failures: 0, Errors: 0, Skipped: 0, Time elapsed: 0.001 s - in jmri.jmrix.xpa.XpaPowerManagerTest
[INFO] Running jmri.jmrix.xpa.XpaMessageTest
[INFO] Tests run: 19, Failures: 0, Errors: 0, Skipped: 0, Time elapsed: 0.01 s - in jmri.jmrix.xpa.XpaMessageTest
[INFO] Running jmri.jmrix.xpa.XpaTurnoutManagerTest
[WARNING] Tests run: 20, Failures: 0, Errors: 0, Skipped: 1, Time elapsed: 0.015 s - in jmri.jmrix.xpa.XpaTurnoutManagerTest
[INFO] Running jmri.jmrix.xpa.XpaThrottleManagerTest
[INFO] Tests run: 16, Failures: 0, Errors: 0, Skipped: 0, Time elapsed: 0.01 s - in jmri.jmrix.xpa.XpaThrottleManagerTest
[INFO] Running jmri.jmrix.debugthrottle.DebugThrottleTest
[INFO] Tests run: 151, Failures: 0, Errors: 0, Skipped: 0, Time elapsed: 0.108 s - in jmri.jmrix.debugthrottle.DebugThrottleTest
[INFO] Running jmri.jmrix.debugthrottle.DebugThrottleManagerTest
[INFO] Tests run: 17, Failures: 0, Errors: 0, Skipped: 0, Time elapsed: 0.007 s - in jmri.jmrix.debugthrottle.DebugThrottleManagerTest
[INFO] Running jmri.jmrix.lenz.XNetConsistTest
[WARNING] Tests run: 17, Failures: 0, Errors: 0, Skipped: 2, Time elapsed: 4.739 s - in jmri.jmrix.lenz.XNetConsistTest
[INFO] Running jmri.jmrix.lenz.configurexml.XNetTurnoutManagerXmlTest
[INFO] Tests run: 1, Failures: 0, Errors: 0, Skipped: 0, Time elapsed: 0 s - in jmri.jmrix.lenz.configurexml.XNetTurnoutManagerXmlTest
[INFO] Running jmri.jmrix.lenz.configurexml.XNetSensorManagerXmlTest
[INFO] Tests run: 1, Failures: 0, Errors: 0, Skipped: 0, Time elapsed: 0 s - in jmri.jmrix.lenz.configurexml.XNetSensorManagerXmlTest
[INFO] Running jmri.jmrix.lenz.configurexml.AbstractXNetSerialConnectionConfigXmlTest
[WARNING] Tests run: 4, Failures: 0, Errors: 0, Skipped: 2, Time elapsed: 0.002 s - in jmri.jmrix.lenz.configurexml.AbstractXNetSerialConnectionConfigXmlTest
[INFO] Running jmri.jmrix.lenz.configurexml.XNetStreamConnectionConfigXmlTest
[INFO] Tests run: 4, Failures: 0, Errors: 0, Skipped: 0, Time elapsed: 0.009 s - in jmri.jmrix.lenz.configurexml.XNetStreamConnectionConfigXmlTest
[INFO] Running jmri.jmrix.lenz.configurexml.XNetLightManagerXmlTest
[INFO] Tests run: 1, Failures: 0, Errors: 0, Skipped: 0, Time elapsed: 0 s - in jmri.jmrix.lenz.configurexml.XNetLightManagerXmlTest
[INFO] Running jmri.jmrix.lenz.XNetPacketizerTest
[INFO] Tests run: 9, Failures: 0, Errors: 0, Skipped: 0, Time elapsed: 1.148 s - in jmri.jmrix.lenz.XNetPacketizerTest
[INFO] Running jmri.jmrix.lenz.swing.AbstractXPressNetActionTest
[INFO] Tests run: 1, Failures: 0, Errors: 0, Skipped: 0, Time elapsed: 0.003 s - in jmri.jmrix.lenz.swing.AbstractXPressNetActionTest
[INFO] Running jmri.jmrix.lenz.swing.BundleTest
[INFO] Tests run: 6, Failures: 0, Errors: 0, Skipped: 0, Time elapsed: 0.011 s - in jmri.jmrix.lenz.swing.BundleTest
[INFO] Running jmri.jmrix.lenz.swing.li101.LI101ActionTest
[INFO] Tests run: 3, Failures: 0, Errors: 0, Skipped: 0, Time elapsed: 0.06 s - in jmri.jmrix.lenz.swing.li101.LI101ActionTest
[INFO] Running jmri.jmrix.lenz.swing.li101.BundleTest
[INFO] Tests run: 6, Failures: 0, Errors: 0, Skipped: 0, Time elapsed: 0 s - in jmri.jmrix.lenz.swing.li101.BundleTest
[INFO] Running jmri.jmrix.lenz.swing.li101.LI101FrameTest
[INFO] Tests run: 2, Failures: 0, Errors: 0, Skipped: 0, Time elapsed: 0.07 s - in jmri.jmrix.lenz.swing.li101.LI101FrameTest
[INFO] Running jmri.jmrix.lenz.swing.mon.XNetMonPaneTest
[INFO] Tests run: 14, Failures: 0, Errors: 0, Skipped: 0, Time elapsed: 1.243 s - in jmri.jmrix.lenz.swing.mon.XNetMonPaneTest
[INFO] Running jmri.jmrix.lenz.swing.mon.BundleTest
[INFO] Tests run: 6, Failures: 0, Errors: 0, Skipped: 0, Time elapsed: 0 s - in jmri.jmrix.lenz.swing.mon.BundleTest
[INFO] Running jmri.jmrix.lenz.swing.mon.XNetMonActionTest
[INFO] Tests run: 1, Failures: 0, Errors: 0, Skipped: 0, Time elapsed: 0.001 s - in jmri.jmrix.lenz.swing.mon.XNetMonActionTest
[INFO] Running jmri.jmrix.lenz.swing.XNetComponentFactoryTest
[INFO] Tests run: 1, Failures: 0, Errors: 0, Skipped: 0, Time elapsed: 0 s - in jmri.jmrix.lenz.swing.XNetComponentFactoryTest
[INFO] Running jmri.jmrix.lenz.swing.packetgen.BundleTest
[INFO] Tests run: 6, Failures: 0, Errors: 0, Skipped: 0, Time elapsed: 0 s - in jmri.jmrix.lenz.swing.packetgen.BundleTest
[INFO] Running jmri.jmrix.lenz.swing.packetgen.PacketGenActionTest
[INFO] Tests run: 3, Failures: 0, Errors: 0, Skipped: 0, Time elapsed: 0.043 s - in jmri.jmrix.lenz.swing.packetgen.PacketGenActionTest
[INFO] Running jmri.jmrix.lenz.swing.packetgen.PacketGenFrameTest
[INFO] Tests run: 4, Failures: 0, Errors: 0, Skipped: 0, Time elapsed: 0.099 s - in jmri.jmrix.lenz.swing.packetgen.PacketGenFrameTest
[INFO] Running jmri.jmrix.lenz.swing.lzv100.LZV100FrameTest
[INFO] Tests run: 2, Failures: 0, Errors: 0, Skipped: 0, Time elapsed: 0.15 s - in jmri.jmrix.lenz.swing.lzv100.LZV100FrameTest
[INFO] Running jmri.jmrix.lenz.swing.lzv100.BundleTest
[INFO] Tests run: 6, Failures: 0, Errors: 0, Skipped: 0, Time elapsed: 0 s - in jmri.jmrix.lenz.swing.lzv100.BundleTest
[INFO] Running jmri.jmrix.lenz.swing.lzv100.LZV100ActionTest
[INFO] Tests run: 3, Failures: 0, Errors: 0, Skipped: 0, Time elapsed: 0.04 s - in jmri.jmrix.lenz.swing.lzv100.LZV100ActionTest
[INFO] Running jmri.jmrix.lenz.swing.XNetMenuTest
[INFO] Tests run: 1, Failures: 0, Errors: 0, Skipped: 0, Time elapsed: 0.005 s - in jmri.jmrix.lenz.swing.XNetMenuTest
[INFO] Running jmri.jmrix.lenz.swing.systeminfo.SystemInfoFrameTest
[INFO] Tests run: 2, Failures: 0, Errors: 0, Skipped: 0, Time elapsed: 0.084 s - in jmri.jmrix.lenz.swing.systeminfo.SystemInfoFrameTest
[INFO] Running jmri.jmrix.lenz.swing.systeminfo.BundleTest
[INFO] Tests run: 6, Failures: 0, Errors: 0, Skipped: 0, Time elapsed: 0 s - in jmri.jmrix.lenz.swing.systeminfo.BundleTest
[INFO] Running jmri.jmrix.lenz.swing.systeminfo.SystemInfoActionTest
[INFO] Tests run: 3, Failures: 0, Errors: 0, Skipped: 0, Time elapsed: 0.048 s - in jmri.jmrix.lenz.swing.systeminfo.SystemInfoActionTest
[INFO] Running jmri.jmrix.lenz.swing.lz100.BundleTest
[INFO] Tests run: 6, Failures: 0, Errors: 0, Skipped: 0, Time elapsed: 0.002 s - in jmri.jmrix.lenz.swing.lz100.BundleTest
[INFO] Running jmri.jmrix.lenz.swing.lz100.LZ100FrameTest
[INFO] Tests run: 2, Failures: 0, Errors: 0, Skipped: 0, Time elapsed: 0.074 s - in jmri.jmrix.lenz.swing.lz100.LZ100FrameTest
[INFO] Running jmri.jmrix.lenz.swing.lz100.LZ100ActionTest
[INFO] Tests run: 3, Failures: 0, Errors: 0, Skipped: 0, Time elapsed: 0.036 s - in jmri.jmrix.lenz.swing.lz100.LZ100ActionTest
[INFO] Running jmri.jmrix.lenz.swing.lz100.LZ100InternalFrameTest
[INFO] Tests run: 1, Failures: 0, Errors: 0, Skipped: 0, Time elapsed: 0.004 s - in jmri.jmrix.lenz.swing.lz100.LZ100InternalFrameTest
[INFO] Running jmri.jmrix.lenz.swing.lv102.LV102ActionTest
[INFO] Tests run: 3, Failures: 0, Errors: 0, Skipped: 0, Time elapsed: 0.049 s - in jmri.jmrix.lenz.swing.lv102.LV102ActionTest
[INFO] Running jmri.jmrix.lenz.swing.lv102.LV102InternalFrameTest
[INFO] Tests run: 3, Failures: 0, Errors: 0, Skipped: 0, Time elapsed: 0.138 s - in jmri.jmrix.lenz.swing.lv102.LV102InternalFrameTest
[INFO] Running jmri.jmrix.lenz.swing.lv102.LV102FrameTest
[INFO] Tests run: 3, Failures: 0, Errors: 0, Skipped: 0, Time elapsed: 0.169 s - in jmri.jmrix.lenz.swing.lv102.LV102FrameTest
[INFO] Running jmri.jmrix.lenz.swing.lv102.BundleTest
[INFO] Tests run: 6, Failures: 0, Errors: 0, Skipped: 0, Time elapsed: 0.003 s - in jmri.jmrix.lenz.swing.lv102.BundleTest
[INFO] Running jmri.jmrix.lenz.swing.liusb.LIUSBConfigFrameTest
[INFO] Tests run: 2, Failures: 0, Errors: 0, Skipped: 0, Time elapsed: 0.085 s - in jmri.jmrix.lenz.swing.liusb.LIUSBConfigFrameTest
[INFO] Running jmri.jmrix.lenz.swing.liusb.BundleTest
[INFO] Tests run: 6, Failures: 0, Errors: 0, Skipped: 0, Time elapsed: 0 s - in jmri.jmrix.lenz.swing.liusb.BundleTest
[INFO] Running jmri.jmrix.lenz.swing.liusb.LIUSBConfigActionTest
[INFO] Tests run: 3, Failures: 0, Errors: 0, Skipped: 0, Time elapsed: 0.044 s - in jmri.jmrix.lenz.swing.liusb.LIUSBConfigActionTest
[INFO] Running jmri.jmrix.lenz.swing.stackmon.StackMonFrameTest
[INFO] Tests run: 2, Failures: 0, Errors: 0, Skipped: 0, Time elapsed: 0.108 s - in jmri.jmrix.lenz.swing.stackmon.StackMonFrameTest
[INFO] Running jmri.jmrix.lenz.swing.stackmon.StackMonDataModelTest
[INFO] Tests run: 1, Failures: 0, Errors: 0, Skipped: 0, Time elapsed: 0 s - in jmri.jmrix.lenz.swing.stackmon.StackMonDataModelTest
[INFO] Running jmri.jmrix.lenz.swing.stackmon.BundleTest
[INFO] Tests run: 6, Failures: 0, Errors: 0, Skipped: 0, Time elapsed: 0.002 s - in jmri.jmrix.lenz.swing.stackmon.BundleTest
[INFO] Running jmri.jmrix.lenz.swing.stackmon.StackMonActionTest
[INFO] Tests run: 2, Failures: 0, Errors: 0, Skipped: 0, Time elapsed: 0.043 s - in jmri.jmrix.lenz.swing.stackmon.StackMonActionTest
[INFO] Running jmri.jmrix.lenz.li100.ConnectionConfigTest
[WARNING] Tests run: 8, Failures: 0, Errors: 0, Skipped: 5, Time elapsed: 0.04 s - in jmri.jmrix.lenz.li100.ConnectionConfigTest
[INFO] Running jmri.jmrix.lenz.li100.configurexml.ConnectionConfigXmlTest
[INFO] Tests run: 4, Failures: 0, Errors: 0, Skipped: 0, Time elapsed: 0.041 s - in jmri.jmrix.lenz.li100.configurexml.ConnectionConfigXmlTest
[INFO] Running jmri.jmrix.lenz.li100.LI100XNetProgrammerTest
[INFO] Tests run: 26, Failures: 0, Errors: 0, Skipped: 0, Time elapsed: 0.059 s - in jmri.jmrix.lenz.li100.LI100XNetProgrammerTest
[INFO] Running jmri.jmrix.lenz.li100.BundleTest
[INFO] Tests run: 6, Failures: 0, Errors: 0, Skipped: 0, Time elapsed: 0 s - in jmri.jmrix.lenz.li100.BundleTest
[INFO] Running jmri.jmrix.lenz.li100.LI100XNetInitializationManagerTest
[INFO] Tests run: 1, Failures: 0, Errors: 0, Skipped: 0, Time elapsed: 0.073 s - in jmri.jmrix.lenz.li100.LI100XNetInitializationManagerTest
[INFO] Running jmri.jmrix.lenz.li100.LI100XNetPacketizerTest
[INFO] Tests run: 9, Failures: 0, Errors: 0, Skipped: 0, Time elapsed: 1.148 s - in jmri.jmrix.lenz.li100.LI100XNetPacketizerTest
[INFO] Running jmri.jmrix.lenz.li100.LI100AdapterTest
[INFO] Tests run: 1, Failures: 0, Errors: 0, Skipped: 0, Time elapsed: 0 s - in jmri.jmrix.lenz.li100.LI100AdapterTest
[INFO] Running JUnit Vintage
BlueCove log redirected to log4j
[WARNING] Tests run: 11188, Failures: 0, Errors: 0, Skipped: 424, Time elapsed: 467.614 s - in JUnit Vintage
[INFO] 
[INFO] Results:
[INFO] 
[WARNING] Tests run: 42335, Failures: 0, Errors: 0, Skipped: 830
[INFO] 
[JENKINS] Recording test results
[WARNING] Attempt to (de-)serialize anonymous class hudson.maven.reporters.SurefireArchiver$2; see: https://jenkins.io/redirect/serialization-of-anonymous-classes/
[INFO] 
[INFO] --- pitest-maven:1.4.10:mutationCoverage (default-cli) @ jmri ---
[INFO] Found plugin : Default csv report plugin
[INFO] Found plugin : Default xml report plugin
[INFO] Found plugin : Default html report plugin
[INFO] Found plugin : Static initializer code detector plugin
[INFO] Found plugin : Static initializer filter plugin
[INFO] Found plugin : Excluded annotations plugin
[INFO] Found plugin : Inlined finally block filter plugin
[INFO] Found plugin : Try with resources filter
[INFO] Found plugin : Implicit null check filter
[INFO] Found plugin : Method reference null check filter
[INFO] Found plugin : For each loop filter
[INFO] Found plugin : Logging calls filter
[INFO] Found plugin : Infinite for loop filter
[INFO] Found plugin : Long running iterator loop filter
[INFO] Found plugin : For loop counter filter
[INFO] Found plugin : Kotlin junk mutations filter
[INFO] Found plugin : Max mutations per class limit
[INFO] Found plugin : Equals shortcut equivalent mutant filter
[INFO] Found plugin : Trivial return vals equivalence filter
[INFO] Found plugin : Mutant export plugin
[INFO] Found shared classpath plugin : Default mutation engine
[INFO] Found shared classpath plugin : JUnit plugin
[INFO] Found shared classpath plugin : TestNG plugin
[INFO] Adding org.pitest:pitest to SUT classpath
[INFO] Mutating from /var/lib/jenkins/jobs/Development/jobs/PIT/workspace/target/classes
[INFO] Defaulting target classes to match packages in build directory
1:28:57 PM PIT >> INFO : Verbose logging is disabled. If you encounter a problem, please enable it before reporting an issue.
1:29:04 PM PIT >> INFO : MINION : Picked up JAVA_TOOL_OPTIONS: -Dfile.encoding=UTF-8

1:29:04 PM PIT >> INFO : Sending 12360 test classes to minion
1:29:04 PM PIT >> INFO : Sent tests to minion
1:29:05 PM PIT >> INFO : MINION : 1:29:05 PM PIT >> INFO : Checking environment

1:29:16 PM PIT >> INFO : MINION : 1:29:16 PM PIT >> WARNING : Could not load jmri.script.import.imported$py (NoClassDefFoundError: jmri/script/import/imported$py (wrong name: imported$py))

1:30:31 PM PIT >> INFO : MINION : 1:30:31 PM PIT >> INFO : Found  41787 tests

1:30:31 PM PIT >> INFO : MINION : 1:30:31 PM PIT >> INFO : Dependency analysis reduced number of potential tests by 0

1:30:31 PM PIT >> INFO : MINION : 1:30:31 PM PIT >> INFO : 41787 tests received

/1:30:32 PM PIT >> INFO : MINION : 1:30:32 PM PIT >> WARNING : More threads at end of test (8) testCTor(apps.AppsLaunchFrameTest) than start. (6)

-\|/-\|/-\|/-\|/-\1:30:32 PM PIT >> INFO : MINION : 1:30:32 PM PIT >> WARNING : More threads at end of test (11) testCTor(apps.FileLocationPaneTest) than start. (8)

|/-\|/-\|1:30:32 PM PIT >> WARNING : Error while watching child process
java.util.concurrent.ExecutionException: org.pitest.util.PitError: null

Please copy and paste the information and the complete stacktrace below when reporting an issue
VM : Java HotSpot(TM) 64-Bit Server VM
Vendor : Oracle Corporation
Version : 25.181-b13
Uptime : 2784722
Input -> 
 1 : -Dfile.encoding=UTF-8
 2 : -Djmri.skipschematests=true
BootClassPathSupported : true

	at java.util.concurrent.FutureTask.report(FutureTask.java:122)
	at java.util.concurrent.FutureTask.get(FutureTask.java:192)
	at org.pitest.util.CommunicationThread.waitToFinish(CommunicationThread.java:60)
	at org.pitest.coverage.execute.CoverageProcess.waitToDie(CoverageProcess.java:35)
	at org.pitest.coverage.execute.DefaultCoverageGenerator.gatherCoverageData(DefaultCoverageGenerator.java:138)
	at org.pitest.coverage.execute.DefaultCoverageGenerator.calculateCoverage(DefaultCoverageGenerator.java:89)
	at org.pitest.coverage.execute.DefaultCoverageGenerator.calculateCoverage(DefaultCoverageGenerator.java:51)
	at org.pitest.mutationtest.tooling.MutationCoverage.runReport(MutationCoverage.java:115)
	at org.pitest.mutationtest.tooling.EntryPoint.execute(EntryPoint.java:120)
	at org.pitest.mutationtest.tooling.EntryPoint.execute(EntryPoint.java:50)
	at org.pitest.maven.RunPitStrategy.execute(RunPitStrategy.java:35)
	at org.pitest.maven.AbstractPitMojo.analyse(AbstractPitMojo.java:466)
	at org.pitest.maven.AbstractPitMojo.execute(AbstractPitMojo.java:407)
	at org.apache.maven.plugin.DefaultBuildPluginManager.executeMojo(DefaultBuildPluginManager.java:137)
	at org.apache.maven.lifecycle.internal.MojoExecutor.execute(MojoExecutor.java:210)
	at org.apache.maven.lifecycle.internal.MojoExecutor.execute(MojoExecutor.java:156)
	at org.apache.maven.lifecycle.internal.MojoExecutor.execute(MojoExecutor.java:148)
	at org.apache.maven.lifecycle.internal.LifecycleModuleBuilder.buildProject(LifecycleModuleBuilder.java:117)
	at org.apache.maven.lifecycle.internal.LifecycleModuleBuilder.buildProject(LifecycleModuleBuilder.java:81)
	at org.apache.maven.lifecycle.internal.builder.singlethreaded.SingleThreadedBuilder.build(SingleThreadedBuilder.java:56)
	at org.apache.maven.lifecycle.internal.LifecycleStarter.execute(LifecycleStarter.java:128)
	at org.apache.maven.DefaultMaven.doExecute(DefaultMaven.java:305)
	at org.apache.maven.DefaultMaven.doExecute(DefaultMaven.java:192)
	at org.apache.maven.DefaultMaven.execute(DefaultMaven.java:105)
	at org.jvnet.hudson.maven3.launcher.Maven35Launcher.main(Maven35Launcher.java:130)
	at sun.reflect.NativeMethodAccessorImpl.invoke0(Native Method)
	at sun.reflect.NativeMethodAccessorImpl.invoke(NativeMethodAccessorImpl.java:62)
	at sun.reflect.DelegatingMethodAccessorImpl.invoke(DelegatingMethodAccessorImpl.java:43)
	at java.lang.reflect.Method.invoke(Method.java:498)
	at org.codehaus.plexus.classworlds.launcher.Launcher.launchEnhanced(Launcher.java:282)
	at org.codehaus.plexus.classworlds.launcher.Launcher.launch(Launcher.java:225)
	at jenkins.maven3.agent.Maven35Main.launch(Maven35Main.java:176)
	at sun.reflect.NativeMethodAccessorImpl.invoke0(Native Method)
	at sun.reflect.NativeMethodAccessorImpl.invoke(NativeMethodAccessorImpl.java:62)
	at sun.reflect.DelegatingMethodAccessorImpl.invoke(DelegatingMethodAccessorImpl.java:43)
	at java.lang.reflect.Method.invoke(Method.java:498)
	at hudson.maven.Maven3Builder.call(Maven3Builder.java:139)
	at hudson.maven.Maven3Builder.call(Maven3Builder.java:70)
	at hudson.remoting.UserRequest.perform(UserRequest.java:212)
	at hudson.remoting.UserRequest.perform(UserRequest.java:54)
	at hudson.remoting.Request$2.run(Request.java:369)
	at hudson.remoting.InterceptingExecutorService$1.call(InterceptingExecutorService.java:72)
	at java.util.concurrent.FutureTask.run(FutureTask.java:266)
	at java.util.concurrent.ThreadPoolExecutor.runWorker(ThreadPoolExecutor.java:1149)
	at java.util.concurrent.ThreadPoolExecutor$Worker.run(ThreadPoolExecutor.java:624)
	at java.lang.Thread.run(Thread.java:748)
Caused by: org.pitest.util.PitError: null

Please copy and paste the information and the complete stacktrace below when reporting an issue
VM : Java HotSpot(TM) 64-Bit Server VM
Vendor : Oracle Corporation
Version : 25.181-b13
Uptime : 2784722
Input -> 
 1 : -Dfile.encoding=UTF-8
 2 : -Djmri.skipschematests=true
BootClassPathSupported : true

	at org.pitest.util.Unchecked.translateCheckedException(Unchecked.java:20)
	at org.pitest.util.SafeDataInputStream.readLong(SafeDataInputStream.java:97)
	at org.pitest.coverage.execute.Receive.readProbeHit(Receive.java:83)
	at org.pitest.coverage.execute.Receive.handleTestEnd(Receive.java:75)
	at org.pitest.coverage.execute.Receive.apply(Receive.java:45)
	at org.pitest.util.SocketReadingCallable.receiveResults(SocketReadingCallable.java:57)
	at org.pitest.util.SocketReadingCallable.call(SocketReadingCallable.java:35)
	at org.pitest.util.SocketReadingCallable.call(SocketReadingCallable.java:12)
	at java.util.concurrent.FutureTask.run(FutureTask.java:266)
	... 1 more
Caused by: java.io.EOFException
	at java.io.DataInputStream.readFully(DataInputStream.java:197)
	at java.io.DataInputStream.readLong(DataInputStream.java:416)
	at org.pitest.util.SafeDataInputStream.readLong(SafeDataInputStream.java:95)
	... 8 more
1:30:32 PM PIT >> SEVERE : Coverage generator Minion exited abnormally due to UNKNOWN_ERROR
[BFA] Scanning build for known causes...
[BFA] No failure causes found
[BFA] Done. 0s
[INFO] ------------------------------------------------------------------------
[INFO] BUILD FAILURE
[INFO] ------------------------------------------------------------------------
[INFO] Total time:  46:19 min
[INFO] Finished at: 2020-01-27T13:30:33Z
[INFO] ------------------------------------------------------------------------
Waiting for Jenkins to finish collecting data
[ERROR] Failed to execute goal org.pitest:pitest-maven:1.4.10:mutationCoverage (default-cli) on project jmri: Execution default-cli of goal org.pitest:pitest-maven:1.4.10:mutationCoverage failed: Coverage generation minion exited abnormally!
[ERROR] 
[ERROR] Please copy and paste the information and the complete stacktrace below when reporting an issue
[ERROR] VM : Java HotSpot(TM) 64-Bit Server VM
[ERROR] Vendor : Oracle Corporation
[ERROR] Version : 25.181-b13
[ERROR] Uptime : 2784733
[ERROR] Input ->
[ERROR] 1 : -Dfile.encoding=UTF-8
[ERROR] 2 : -Djmri.skipschematests=true
[ERROR] BootClassPathSupported : true
[ERROR] 
[ERROR] 
[ERROR] Please copy and paste the information and the complete stacktrace below when reporting an issue
[ERROR] VM : Java HotSpot(TM) 64-Bit Server VM
[ERROR] Vendor : Oracle Corporation
[ERROR] Version : 25.181-b13
[ERROR] Uptime : 2784733
[ERROR] Input ->
[ERROR] 1 : -Dfile.encoding=UTF-8
[ERROR] 2 : -Djmri.skipschematests=true
[ERROR] BootClassPathSupported : true
[ERROR] -> [Help 1]
[ERROR] 
[ERROR] To see the full stack trace of the errors, re-run Maven with the -e switch.
[ERROR] Re-run Maven using the -X switch to enable full debug logging.
[ERROR] 
[ERROR] For more information about the errors and possible solutions, please read the following articles:
[ERROR] [Help 1] http://cwiki.apache.org/confluence/display/MAVEN/PluginExecutionException
[JENKINS] Archiving /var/lib/jenkins/jobs/Development/jobs/PIT/workspace/pom.xml to org.jmri/jmri/4.19.3-SNAPSHOT/jmri-4.19.3-SNAPSHOT.pom
Xvfb stopping
channel stopped
Looking for PIT reports in /var/lib/jenkins/jobs/Development/jobs/PIT/workspace
ERROR: Step ‘Record Pit mutation testing report’ aborted due to exception: 
java.io.IOException: No reports found at location:target/pit-reports/**/mutations.xml 
	at org.jenkinsci.plugins.pitmutation.PitPublisher$ParseReportCallable.invoke(PitPublisher.java:338)
	at org.jenkinsci.plugins.pitmutation.PitPublisher$ParseReportCallable.invoke(PitPublisher.java:320)
	at hudson.FilePath.act(FilePath.java:1078)
	at hudson.FilePath.act(FilePath.java:1061)
	at org.jenkinsci.plugins.pitmutation.PitPublisher.perform(PitPublisher.java:91)
	at hudson.tasks.BuildStepCompatibilityLayer.perform(BuildStepCompatibilityLayer.java:79)
	at hudson.tasks.BuildStepMonitor$3.perform(BuildStepMonitor.java:45)
	at hudson.model.AbstractBuild$AbstractBuildExecution.perform(AbstractBuild.java:741)
	at hudson.model.AbstractBuild$AbstractBuildExecution.performAllBuildSteps(AbstractBuild.java:690)
	at hudson.maven.MavenModuleSetBuild$MavenModuleSetBuildExecution.post2(MavenModuleSetBuild.java:1073)
	at hudson.model.AbstractBuild$AbstractBuildExecution.post(AbstractBuild.java:635)
	at hudson.model.Run.execute(Run.java:1840)
	at hudson.maven.MavenModuleSetBuild.run(MavenModuleSetBuild.java:543)
	at hudson.model.ResourceController.execute(ResourceController.java:97)
	at hudson.model.Executor.run(Executor.java:429)
[BFA] Scanning build for known causes...
[BFA] No failure causes found
[BFA] Done. 0s
Finished: FAILURE